{"text_format":"1","workbook":"xlsx","n_sheets":4,"sheets":["Modele","Fonction Distance","Fonction Cap","Couper_Inserer"],"not_rendered":{"charts":0,"images":0,"macros":1,"external_links":0,"defined_names":1,"comments":0,"pivot_tables":0},"unopened":[{"sheet":"Fonction Distance","index":1,"reason":"part_missing"},{"sheet":"Fonction Cap","index":2,"reason":"part_missing"},{"sheet":"Couper_Inserer","index":3,"reason":"part_missing"}],"bounds":{"document_bytes":16777216,"sheet_cells":100000,"rows_first":2000,"rows_last":500,"rows_between":2000,"halvings":0,"cell_chars":16384,"cell_head_chars":4096},"cells_cut":0,"cells_raw":0,"read":"whole","date_system":"1904"}

{"sheet":"Modele","index":0,"n_rows":103,"n_cols":22,"rows_kept":103,"cut":false,"hidden":false,"merged":[]}
["Version du 20/12/95","Position",null,null,null,null,null,null,null,"Distance (km)",null,"Slack","Cable Distance (km)",null,"Cable","Cumulative","Totals","Approx",null,null,"WGS 84"]
["Christian Auroux","Number","Latitude",null,null,"Longitude",null,null,"Heading","Between","Cumulative","%","Between","Cumulative","Type","by type","By Type","Depth",null,"Comments","a",6378137]
["rplcap",null,null,null,null,null,null,null,null,"Positions","Total",null,"Positions","Total",null,null,"(km)","(m)",null,null,"b",6356752.3140000002]
[]
[null,1,1,0,{"$f":"IF(OR(C5<0,AND(C5=0,D5<0)),\"S\",\"N\")","v":"N"},0,0,{"$f":"IF(OR(F5<0,AND(F5=0,G5<0)),\"W\",\"E\")","v":"E"},null,null,0,null,null,0,null,0,{"$f":"IF(O4=O6,\"\",P5)","v":0}]
[null,null,null,null,null,null,null,null,{"$f":"Cap(C5,D5,F5,G5,C7,D7,F7,G7)","v":0},{"$f":"Distance(C5,D5,F5,G5,C7,D7,F7,G7)","v":1.8429103657645376},null,2,{"$f":"J6*(1+L6/100)","v":1.8797685730798284},null,"DA"]
[null,{"$f":"B5+1","v":2},1,1,{"$f":"IF(OR(C7<0,AND(C7=0,D7<0)),\"S\",\"N\")","v":"N"},0,0,{"$f":"IF(OR(F7<0,AND(F7=0,G7<0)),\"W\",\"E\")","v":"E"},null,null,{"$f":"K5+J6","v":1.8429103657645376},null,null,{"$f":"N5+M6","v":1.8797685730798284},null,{"$f":"IF(O6=O4,P5+M6,M6)","v":1.8797685730798284},{"$f":"IF(O6=O8,\"\",P7)","v":""}]
[null,null,null,null,null,null,null,null,{"$f":"Cap(C7,D7,F7,G7,C9,D9,F9,G9)","v":90},{"$f":"Distance(C7,D7,F7,G7,C9,D9,F9,G9)","v":1.8550347289696258},null,2,{"$f":"J8*(1+L8/100)","v":1.8921354235490184},null,"DA"]
[null,{"$f":"B7+1","v":3},1,1,{"$f":"IF(OR(C9<0,AND(C9=0,D9<0)),\"S\",\"N\")","v":"N"},0,1,{"$f":"IF(OR(F9<0,AND(F9=0,G9<0)),\"W\",\"E\")","v":"E"},null,null,{"$f":"K7+J8","v":3.6979450947341634},null,null,{"$f":"N7+M8","v":3.771903996628847},null,{"$f":"IF(O8=O6,P7+M8,M8)","v":3.771903996628847},{"$f":"IF(O8=O10,\"\",P9)","v":3.771903996628847}]
[null,null,null,null,null,null,null,null,{"$f":"Cap(C9,D9,F9,G9,C11,D11,F11,G11)","v":180.94546550919566},{"$f":"Distance(C9,D9,F9,G9,C11,D11,F11,G11)","v":112.4326084923589},null,null,{"$f":"J10*(1+L10/100)","v":112.4326084923589}]
[null,{"$f":"B9+1","v":4},0,0,{"$f":"IF(OR(C11<0,AND(C11=0,D11<0)),\"S\",\"N\")","v":"N"},0,0,{"$f":"IF(OR(F11<0,AND(F11=0,G11<0)),\"W\",\"E\")","v":"E"},null,null,{"$f":"K9+J10","v":116.13055358709306},null,null,{"$f":"N9+M10","v":116.20451248898775},null,{"$f":"IF(O10=O8,P9+M10,M10)","v":112.4326084923589},{"$f":"IF(O10=O12,\"\",P11)","v":""}]
[null,null,null,null,null,null,null,null,{"$f":"Cap(C11,D11,F11,G11,C13,D13,F13,G13)","v":0},{"$f":"Distance(C11,D11,F11,G11,C13,D13,F13,G13)","v":0},null,null,{"$f":"J12*(1+L12/100)","v":0}]
[null,{"$f":"B11+1","v":5},0,0,{"$f":"IF(OR(C13<0,AND(C13=0,D13<0)),\"S\",\"N\")","v":"N"},0,0,{"$f":"IF(OR(F13<0,AND(F13=0,G13<0)),\"W\",\"E\")","v":"E"},null,null,{"$f":"K11+J12","v":116.13055358709306},null,null,{"$f":"N11+M12","v":116.20451248898775},null,{"$f":"IF(O12=O10,P11+M12,M12)","v":112.4326084923589},{"$f":"IF(O12=O14,\"\",P13)","v":""}]
[null,null,null,null,null,null,null,null,{"$f":"Cap(C13,D13,F13,G13,C15,D15,F15,G15)","v":0},{"$f":"Distance(C13,D13,F13,G13,C15,D15,F15,G15)","v":0},null,null,{"$f":"J14*(1+L14/100)","v":0}]
[null,{"$f":"B13+1","v":6},0,0,{"$f":"IF(OR(C15<0,AND(C15=0,D15<0)),\"S\",\"N\")","v":"N"},0,0,{"$f":"IF(OR(F15<0,AND(F15=0,G15<0)),\"W\",\"E\")","v":"E"},null,null,{"$f":"K13+J14","v":116.13055358709306},null,null,{"$f":"N13+M14","v":116.20451248898775},null,{"$f":"IF(O14=O12,P13+M14,M14)","v":112.4326084923589},{"$f":"IF(O14=O16,\"\",P15)","v":""}]
[null,null,null,null,null,null,null,null,{"$f":"Cap(C15,D15,F15,G15,C17,D17,F17,G17)","v":0},{"$f":"Distance(C15,D15,F15,G15,C17,D17,F17,G17)","v":0},null,null,{"$f":"J16*(1+L16/100)","v":0}]
[null,{"$f":"B15+1","v":7},0,0,{"$f":"IF(OR(C17<0,AND(C17=0,D17<0)),\"S\",\"N\")","v":"N"},0,0,{"$f":"IF(OR(F17<0,AND(F17=0,G17<0)),\"W\",\"E\")","v":"E"},null,null,{"$f":"K15+J16","v":116.13055358709306},null,null,{"$f":"N15+M16","v":116.20451248898775},null,{"$f":"IF(O16=O14,P15+M16,M16)","v":112.4326084923589},{"$f":"IF(O16=O18,\"\",P17)","v":""}]
[null,null,null,null,null,null,null,null,{"$f":"Cap(C17,D17,F17,G17,C19,D19,F19,G19)","v":0},{"$f":"Distance(C17,D17,F17,G17,C19,D19,F19,G19)","v":0},null,null,{"$f":"J18*(1+L18/100)","v":0}]
[null,{"$f":"B17+1","v":8},0,0,{"$f":"IF(OR(C19<0,AND(C19=0,D19<0)),\"S\",\"N\")","v":"N"},0,0,{"$f":"IF(OR(F19<0,AND(F19=0,G19<0)),\"W\",\"E\")","v":"E"},null,null,{"$f":"K17+J18","v":116.13055358709306},null,null,{"$f":"N17+M18","v":116.20451248898775},null,{"$f":"IF(O18=O16,P17+M18,M18)","v":112.4326084923589},{"$f":"IF(O18=O20,\"\",P19)","v":""}]
[null,null,null,null,null,null,null,null,{"$f":"Cap(C19,D19,F19,G19,C21,D21,F21,G21)","v":0},{"$f":"Distance(C19,D19,F19,G19,C21,D21,F21,G21)","v":0},null,null,{"$f":"J20*(1+L20/100)","v":0}]
[null,{"$f":"B19+1","v":9},0,0,{"$f":"IF(OR(C21<0,AND(C21=0,D21<0)),\"S\",\"N\")","v":"N"},0,0,{"$f":"IF(OR(F21<0,AND(F21=0,G21<0)),\"W\",\"E\")","v":"E"},null,null,{"$f":"K19+J20","v":116.13055358709306},null,null,{"$f":"N19+M20","v":116.20451248898775},null,{"$f":"IF(O20=O18,P19+M20,M20)","v":112.4326084923589},{"$f":"IF(O20=O22,\"\",P21)","v":""}]
[null,null,null,null,null,null,null,null,{"$f":"Cap(C21,D21,F21,G21,C23,D23,F23,G23)","v":0},{"$f":"Distance(C21,D21,F21,G21,C23,D23,F23,G23)","v":0},null,null,{"$f":"J22*(1+L22/100)","v":0}]
[null,{"$f":"B21+1","v":10},0,0,{"$f":"IF(OR(C23<0,AND(C23=0,D23<0)),\"S\",\"N\")","v":"N"},0,0,{"$f":"IF(OR(F23<0,AND(F23=0,G23<0)),\"W\",\"E\")","v":"E"},null,null,{"$f":"K21+J22","v":116.13055358709306},null,null,{"$f":"N21+M22","v":116.20451248898775},null,{"$f":"IF(O22=O20,P21+M22,M22)","v":112.4326084923589},{"$f":"IF(O22=O24,\"\",P23)","v":""}]
[null,null,null,null,null,null,null,null,{"$f":"Cap(C23,D23,F23,G23,C25,D25,F25,G25)","v":0},{"$f":"Distance(C23,D23,F23,G23,C25,D25,F25,G25)","v":0},null,null,{"$f":"J24*(1+L24/100)","v":0}]
[null,{"$f":"B23+1","v":11},0,0,{"$f":"IF(OR(C25<0,AND(C25=0,D25<0)),\"S\",\"N\")","v":"N"},0,0,{"$f":"IF(OR(F25<0,AND(F25=0,G25<0)),\"W\",\"E\")","v":"E"},null,null,{"$f":"K23+J24","v":116.13055358709306},null,null,{"$f":"N23+M24","v":116.20451248898775},null,{"$f":"IF(O24=O22,P23+M24,M24)","v":112.4326084923589},{"$f":"IF(O24=O26,\"\",P25)","v":""}]
[null,null,null,null,null,null,null,null,{"$f":"Cap(C25,D25,F25,G25,C27,D27,F27,G27)","v":0},{"$f":"Distance(C25,D25,F25,G25,C27,D27,F27,G27)","v":0},null,null,{"$f":"J26*(1+L26/100)","v":0}]
[null,{"$f":"B25+1","v":12},0,0,{"$f":"IF(OR(C27<0,AND(C27=0,D27<0)),\"S\",\"N\")","v":"N"},0,0,{"$f":"IF(OR(F27<0,AND(F27=0,G27<0)),\"W\",\"E\")","v":"E"},null,null,116.13055358709306,null,null,116.20451248898775,null,{"$f":"IF(O26=O24,P25+M26,M26)","v":112.4326084923589},""]
[null,null,null,null,null,null,null,null,{"$f":"Cap(C27,D27,F27,G27,C29,D29,F29,G29)","v":0},0,null,null,0]
[null,{"$f":"B27+1","v":13},0,0,{"$f":"IF(OR(C29<0,AND(C29=0,D29<0)),\"S\",\"N\")","v":"N"},0,0,{"$f":"IF(OR(F29<0,AND(F29=0,G29<0)),\"W\",\"E\")","v":"E"},null,null,116.13055358709306,null,null,116.20451248898775,null,112.4326084923589,""]
[null,null,null,null,null,null,null,null,{"$f":"Cap(C29,D29,F29,G29,C31,D31,F31,G31)","v":0},0,null,null,0]
[null,{"$f":"B29+1","v":14},0,0,{"$f":"IF(OR(C31<0,AND(C31=0,D31<0)),\"S\",\"N\")","v":"N"},0,0,{"$f":"IF(OR(F31<0,AND(F31=0,G31<0)),\"W\",\"E\")","v":"E"},null,null,116.13055358709306,null,null,116.20451248898775,null,112.4326084923589,""]
[null,null,null,null,null,null,null,null,{"$f":"Cap(C31,D31,F31,G31,C33,D33,F33,G33)","v":0},0,null,null,0]
[null,{"$f":"B31+1","v":15},0,0,{"$f":"IF(OR(C33<0,AND(C33=0,D33<0)),\"S\",\"N\")","v":"N"},0,0,{"$f":"IF(OR(F33<0,AND(F33=0,G33<0)),\"W\",\"E\")","v":"E"},null,null,116.13055358709306,null,null,116.20451248898775,null,112.4326084923589,""]
[null,null,null,null,null,null,null,null,{"$f":"Cap(C33,D33,F33,G33,C35,D35,F35,G35)","v":0},0,null,null,0]
[null,{"$f":"B33+1","v":16},0,0,{"$f":"IF(OR(C35<0,AND(C35=0,D35<0)),\"S\",\"N\")","v":"N"},0,0,{"$f":"IF(OR(F35<0,AND(F35=0,G35<0)),\"W\",\"E\")","v":"E"},null,null,{"$f":"K33+J34","v":116.13055358709306},null,null,{"$f":"N33+M34","v":116.20451248898775},null,112.4326084923589,""]
[null,null,null,null,null,null,null,null,{"$f":"Cap(C35,D35,F35,G35,C37,D37,F37,G37)","v":0},{"$f":"Distance(C35,D35,F35,G35,C37,D37,F37,G37)","v":0},null,null,{"$f":"J36*(1+L36/100)","v":0}]
[null,{"$f":"B35+1","v":17},0,0,{"$f":"IF(OR(C37<0,AND(C37=0,D37<0)),\"S\",\"N\")","v":"N"},0,0,{"$f":"IF(OR(F37<0,AND(F37=0,G37<0)),\"W\",\"E\")","v":"E"},null,null,116.13055358709306,null,null,116.20451248898775,null,{"$f":"IF(O36=O34,P35+M36,M36)","v":112.4326084923589},{"$f":"IF(O36=O38,\"\",P37)","v":""}]
[null,null,null,null,null,null,null,null,0,0,null,null,0]
[null,{"$f":"B37+1","v":18},0,0,{"$f":"IF(OR(C39<0,AND(C39=0,D39<0)),\"S\",\"N\")","v":"N"},0,0,{"$f":"IF(OR(F39<0,AND(F39=0,G39<0)),\"W\",\"E\")","v":"E"},null,null,116.13055358709306,null,null,116.20451248898775,null,{"$f":"IF(O38=O36,P37+M38,M38)","v":112.4326084923589},{"$f":"IF(O38=O40,\"\",P39)","v":""}]
[null,null,null,null,null,null,null,null,0,0,null,null,0]
[null,{"$f":"B39+1","v":19},0,0,{"$f":"IF(OR(C41<0,AND(C41=0,D41<0)),\"S\",\"N\")","v":"N"},0,0,{"$f":"IF(OR(F41<0,AND(F41=0,G41<0)),\"W\",\"E\")","v":"E"},null,null,116.13055358709306,null,null,116.20451248898775,null,{"$f":"IF(O40=O38,P39+M40,M40)","v":112.4326084923589},{"$f":"IF(O40=O42,\"\",P41)","v":""}]
[null,null,null,null,null,null,null,null,0,0,null,null,0]
[null,{"$f":"B41+1","v":20},0,0,{"$f":"IF(OR(C43<0,AND(C43=0,D43<0)),\"S\",\"N\")","v":"N"},0,0,{"$f":"IF(OR(F43<0,AND(F43=0,G43<0)),\"W\",\"E\")","v":"E"},null,null,{"$f":"K41+J42","v":116.13055358709306},null,null,{"$f":"N41+M42","v":116.20451248898775},null,{"$f":"IF(O42=O40,P41+M42,M42)","v":112.4326084923589},{"$f":"IF(O42=O44,\"\",P43)","v":""}]
[null,null,null,null,null,null,null,null,0,{"$f":"Distance(C43,D43,F43,G43,C45,D45,F45,G45)","v":0},null,null,{"$f":"J44*(1+L44/100)","v":0}]
[null,{"$f":"B43+1","v":21},0,0,{"$f":"IF(OR(C45<0,AND(C45=0,D45<0)),\"S\",\"N\")","v":"N"},0,0,{"$f":"IF(OR(F45<0,AND(F45=0,G45<0)),\"W\",\"E\")","v":"E"},null,null,{"$f":"K43+J44","v":116.13055358709306},null,null,{"$f":"N43+M44","v":116.20451248898775},null,{"$f":"IF(O44=O42,P43+M44,M44)","v":112.4326084923589},{"$f":"IF(O44=O46,\"\",P45)","v":""}]
[null,null,null,null,null,null,null,null,0,0,null,null,{"$f":"J46*(1+L46/100)","v":0}]
[null,{"$f":"B45+1","v":22},0,0,{"$f":"IF(OR(C47<0,AND(C47=0,D47<0)),\"S\",\"N\")","v":"N"},0,0,{"$f":"IF(OR(F47<0,AND(F47=0,G47<0)),\"W\",\"E\")","v":"E"},null,null,116.13055358709306,null,null,116.20451248898775,null,112.4326084923589,""]
[null,null,null,null,null,null,null,null,0,0,null,null,0]
[null,{"$f":"B47+1","v":23},0,0,{"$f":"IF(OR(C49<0,AND(C49=0,D49<0)),\"S\",\"N\")","v":"N"},0,0,{"$f":"IF(OR(F49<0,AND(F49=0,G49<0)),\"W\",\"E\")","v":"E"},null,null,116.13055358709306,null,null,116.20451248898775,null,112.4326084923589,""]
[null,null,null,null,null,null,null,null,0,0,null,0,0]
[null,{"$f":"B49+1","v":24},0,0,{"$f":"IF(OR(C51<0,AND(C51=0,D51<0)),\"S\",\"N\")","v":"N"},0,0,{"$f":"IF(OR(F51<0,AND(F51=0,G51<0)),\"W\",\"E\")","v":"E"},null,null,116.13055358709306,null,null,116.20451248898775,null,112.4326084923589,""]
[null,null,null,null,null,null,null,null,{"$f":"Cap(C51,D51,F51,G51,C53,D53,F53,G53)","v":0},0,null,0,0]
[null,{"$f":"B51+1","v":25},0,0,{"$f":"IF(OR(C53<0,AND(C53=0,D53<0)),\"S\",\"N\")","v":"N"},0,0,{"$f":"IF(OR(F53<0,AND(F53=0,G53<0)),\"W\",\"E\")","v":"E"},null,null,116.13055358709306,null,null,116.20451248898775,null,112.4326084923589,""]
[null,null,null,null,null,null,null,null,0,0,null,0,0]
[null,{"$f":"B53+1","v":26},0,0,{"$f":"IF(OR(C55<0,AND(C55=0,D55<0)),\"S\",\"N\")","v":"N"},0,0,{"$f":"IF(OR(F55<0,AND(F55=0,G55<0)),\"W\",\"E\")","v":"E"},null,null,116.13055358709306,null,null,116.20451248898775,null,112.4326084923589,""]
[null,null,null,null,null,null,null,null,0,0,null,0,0]
[null,{"$f":"B55+1","v":27},0,0,{"$f":"IF(OR(C57<0,AND(C57=0,D57<0)),\"S\",\"N\")","v":"N"},0,0,{"$f":"IF(OR(F57<0,AND(F57=0,G57<0)),\"W\",\"E\")","v":"E"},null,null,116.13055358709306,null,null,116.20451248898775,null,112.4326084923589,""]
[null,null,null,null,null,null,null,null,0,0,null,0,0]
[null,{"$f":"B57+1","v":28},0,0,{"$f":"IF(OR(C59<0,AND(C59=0,D59<0)),\"S\",\"N\")","v":"N"},0,0,{"$f":"IF(OR(F59<0,AND(F59=0,G59<0)),\"W\",\"E\")","v":"E"},null,null,116.13055358709306,null,null,116.20451248898775,null,112.4326084923589,""]
[null,null,null,null,null,null,null,null,0,0,null,0,0]
[null,{"$f":"B59+1","v":29},0,0,{"$f":"IF(OR(C61<0,AND(C61=0,D61<0)),\"S\",\"N\")","v":"N"},0,0,{"$f":"IF(OR(F61<0,AND(F61=0,G61<0)),\"W\",\"E\")","v":"E"},null,null,116.13055358709306,null,null,116.20451248898775,null,112.4326084923589,""]
[null,null,null,null,null,null,null,null,0,0,null,0,0]
[null,{"$f":"B61+1","v":30},0,0,{"$f":"IF(OR(C63<0,AND(C63=0,D63<0)),\"S\",\"N\")","v":"N"},0,0,{"$f":"IF(OR(F63<0,AND(F63=0,G63<0)),\"W\",\"E\")","v":"E"},null,null,116.13055358709306,null,null,116.20451248898775,null,112.4326084923589,""]
[null,null,null,null,null,null,null,null,0,0,null,0,0]
[null,{"$f":"B63+1","v":31},0,0,{"$f":"IF(OR(C65<0,AND(C65=0,D65<0)),\"S\",\"N\")","v":"N"},0,0,{"$f":"IF(OR(F65<0,AND(F65=0,G65<0)),\"W\",\"E\")","v":"E"},null,null,116.13055358709306,null,null,116.20451248898775,null,112.4326084923589,""]
[null,null,null,null,null,null,null,null,0,0,null,0,0]
[null,{"$f":"B65+1","v":32},0,0,{"$f":"IF(OR(C67<0,AND(C67=0,D67<0)),\"S\",\"N\")","v":"N"},0,0,{"$f":"IF(OR(F67<0,AND(F67=0,G67<0)),\"W\",\"E\")","v":"E"},null,null,116.13055358709306,null,null,116.20451248898775,null,112.4326084923589,""]
[null,null,null,null,null,null,null,null,{"$f":"Cap(C67,D67,F67,G67,C69,D69,F69,G69)","v":0},0,null,0,0]
[null,{"$f":"B67+1","v":33},0,0,{"$f":"IF(OR(C69<0,AND(C69=0,D69<0)),\"S\",\"N\")","v":"N"},0,0,{"$f":"IF(OR(F69<0,AND(F69=0,G69<0)),\"W\",\"E\")","v":"E"},null,null,116.13055358709306,null,null,116.20451248898775,null,112.4326084923589,""]
[null,null,null,null,null,null,null,null,0,0,null,0,0]
[null,{"$f":"B69+1","v":34},0,0,{"$f":"IF(OR(C71<0,AND(C71=0,D71<0)),\"S\",\"N\")","v":"N"},0,0,{"$f":"IF(OR(F71<0,AND(F71=0,G71<0)),\"W\",\"E\")","v":"E"},null,null,116.13055358709306,null,null,116.20451248898775,null,112.4326084923589,""]
[null,null,null,null,null,null,null,null,0,0,null,0,0]
[null,{"$f":"B71+1","v":35},0,0,{"$f":"IF(OR(C73<0,AND(C73=0,D73<0)),\"S\",\"N\")","v":"N"},0,0,{"$f":"IF(OR(F73<0,AND(F73=0,G73<0)),\"W\",\"E\")","v":"E"},null,null,116.13055358709306,null,null,116.20451248898775,null,112.4326084923589,""]
[null,null,null,null,null,null,null,null,0,0,null,0,0]
[null,{"$f":"B73+1","v":36},0,0,{"$f":"IF(OR(C75<0,AND(C75=0,D75<0)),\"S\",\"N\")","v":"N"},0,0,{"$f":"IF(OR(F75<0,AND(F75=0,G75<0)),\"W\",\"E\")","v":"E"},null,null,116.13055358709306,null,null,116.20451248898775,null,112.4326084923589,""]
[null,null,null,null,null,null,null,null,0,0,null,0,0]
[null,{"$f":"B75+1","v":37},0,0,{"$f":"IF(OR(C77<0,AND(C77=0,D77<0)),\"S\",\"N\")","v":"N"},0,0,{"$f":"IF(OR(F77<0,AND(F77=0,G77<0)),\"W\",\"E\")","v":"E"},null,null,116.13055358709306,null,null,116.20451248898775,null,112.4326084923589,""]
[null,null,null,null,null,null,null,null,0,0,null,0,0]
[null,{"$f":"B77+1","v":38},0,0,{"$f":"IF(OR(C79<0,AND(C79=0,D79<0)),\"S\",\"N\")","v":"N"},0,0,{"$f":"IF(OR(F79<0,AND(F79=0,G79<0)),\"W\",\"E\")","v":"E"},null,null,116.13055358709306,null,null,116.20451248898775,null,112.4326084923589,""]
[null,null,null,null,null,null,null,null,0,0,null,0,0]
[null,{"$f":"B79+1","v":39},0,0,{"$f":"IF(OR(C81<0,AND(C81=0,D81<0)),\"S\",\"N\")","v":"N"},0,0,{"$f":"IF(OR(F81<0,AND(F81=0,G81<0)),\"W\",\"E\")","v":"E"},null,null,116.13055358709306,null,null,116.20451248898775,null,112.4326084923589,""]
[null,null,null,null,null,null,null,null,0,0,null,0,0]
[null,{"$f":"B81+1","v":40},0,0,{"$f":"IF(OR(C83<0,AND(C83=0,D83<0)),\"S\",\"N\")","v":"N"},0,0,{"$f":"IF(OR(F83<0,AND(F83=0,G83<0)),\"W\",\"E\")","v":"E"},null,null,116.13055358709306,null,null,116.20451248898775,null,112.4326084923589,""]
[null,null,null,null,null,null,null,null,{"$f":"Cap(C83,D83,F83,G83,C85,D85,F85,G85)","v":0},0,null,0,0]
[null,{"$f":"B83+1","v":41},0,0,{"$f":"IF(OR(C85<0,AND(C85=0,D85<0)),\"S\",\"N\")","v":"N"},0,0,{"$f":"IF(OR(F85<0,AND(F85=0,G85<0)),\"W\",\"E\")","v":"E"},null,null,116.13055358709306,null,null,116.20451248898775,null,112.4326084923589,""]
[null,null,null,null,null,null,null,null,0,0,null,0,0]
[null,{"$f":"B85+1","v":42},0,0,{"$f":"IF(OR(C87<0,AND(C87=0,D87<0)),\"S\",\"N\")","v":"N"},0,0,{"$f":"IF(OR(F87<0,AND(F87=0,G87<0)),\"W\",\"E\")","v":"E"},null,null,116.13055358709306,null,null,116.20451248898775,null,112.4326084923589,""]
[null,null,null,null,null,null,null,null,0,0,null,0,0]
[null,{"$f":"B87+1","v":43},0,0,{"$f":"IF(OR(C89<0,AND(C89=0,D89<0)),\"S\",\"N\")","v":"N"},0,0,{"$f":"IF(OR(F89<0,AND(F89=0,G89<0)),\"W\",\"E\")","v":"E"},null,null,116.13055358709306,null,null,116.20451248898775,null,112.4326084923589,""]
[null,null,null,null,null,null,null,null,0,0,null,0,0]
[null,{"$f":"B89+1","v":44},0,0,{"$f":"IF(OR(C91<0,AND(C91=0,D91<0)),\"S\",\"N\")","v":"N"},0,0,{"$f":"IF(OR(F91<0,AND(F91=0,G91<0)),\"W\",\"E\")","v":"E"},null,null,116.13055358709306,null,null,116.20451248898775,null,112.4326084923589,""]
[null,null,null,null,null,null,null,null,0,0,null,0,0]
[null,{"$f":"B91+1","v":45},0,0,{"$f":"IF(OR(C93<0,AND(C93=0,D93<0)),\"S\",\"N\")","v":"N"},0,0,{"$f":"IF(OR(F93<0,AND(F93=0,G93<0)),\"W\",\"E\")","v":"E"},null,null,116.13055358709306,null,null,116.20451248898775,null,112.4326084923589,""]
[null,null,null,null,null,null,null,null,0,0,null,0,0]
[null,{"$f":"B93+1","v":46},0,0,{"$f":"IF(OR(C95<0,AND(C95=0,D95<0)),\"S\",\"N\")","v":"N"},0,0,{"$f":"IF(OR(F95<0,AND(F95=0,G95<0)),\"W\",\"E\")","v":"E"},null,null,116.13055358709306,null,null,116.20451248898775,null,112.4326084923589,""]
[null,null,null,null,null,null,null,null,0,0,null,0,0]
[null,{"$f":"B95+1","v":47},0,0,{"$f":"IF(OR(C97<0,AND(C97=0,D97<0)),\"S\",\"N\")","v":"N"},0,0,{"$f":"IF(OR(F97<0,AND(F97=0,G97<0)),\"W\",\"E\")","v":"E"},null,null,116.13055358709306,null,null,116.20451248898775,null,112.4326084923589,""]
[null,null,null,null,null,null,null,null,0,0,null,0,0]
[null,{"$f":"B97+1","v":48},0,0,{"$f":"IF(OR(C99<0,AND(C99=0,D99<0)),\"S\",\"N\")","v":"N"},0,0,{"$f":"IF(OR(F99<0,AND(F99=0,G99<0)),\"W\",\"E\")","v":"E"},null,null,116.13055358709306,null,null,116.20451248898775,null,112.4326084923589,""]
[null,null,null,null,null,null,null,null,0,0,null,0,0]
[null,{"$f":"B99+1","v":49},0,0,{"$f":"IF(OR(C101<0,AND(C101=0,D101<0)),\"S\",\"N\")","v":"N"},0,0,{"$f":"IF(OR(F101<0,AND(F101=0,G101<0)),\"W\",\"E\")","v":"E"},null,null,116.13055358709306,null,null,116.20451248898775,null,112.4326084923589,""]
[null,null,null,null,null,null,null,null,{"$f":"Cap(C101,D101,F101,G101,C103,D103,F103,G103)","v":0},{"$f":"Distance(C101,D101,F101,G101,C103,D103,F103,G103)","v":0},null,0,0]
[null,{"$f":"B101+1","v":50},0,0,{"$f":"IF(OR(C103<0,AND(C103=0,D103<0)),\"S\",\"N\")","v":"N"},0,0,{"$f":"IF(OR(F103<0,AND(F103=0,G103<0)),\"W\",\"E\")","v":"E"},null,null,{"$f":"K101+J102","v":116.13055358709306},null,null,{"$f":"N101+M102","v":116.20451248898775},null,{"$f":"IF(O102=O100,P101+M102,M102)","v":112.4326084923589},{"$f":"IF(O102=O104,\"\",P103)","v":""}]