{"text_format":"1","workbook":"xlsx","n_sheets":5,"sheets":["Geodesie","Calcul shift geo","Conversion","Spheroides","Table Datum Shifts"],"not_rendered":{"charts":0,"images":0,"macros":1,"external_links":0,"defined_names":2,"comments":0,"pivot_tables":0},"unopened":[{"sheet":"Calcul shift geo","index":1,"reason":"part_missing"}],"bounds":{"document_bytes":16777216,"sheet_cells":100000,"rows_first":2000,"rows_last":500,"rows_between":2000,"halvings":0,"cell_chars":16384,"cell_head_chars":4096},"cells_cut":0,"cells_raw":0,"read":"whole","date_system":"1904"}

{"sheet":"Geodesie","index":0,"n_rows":26,"n_cols":11,"rows_kept":26,"cut":false,"hidden":false,"merged":[]}
["Paramètres de Base des Géodésies Utilisées"]
[]
["Index",null,null,"Système 1",null,null,"Index",null,null,"Système 2"]
["Datum:",1,null,"Région & Datum:",{"$f":"(INDEX('Table Datum Shifts'!B15:B203,B4))","v":"Monde / WGS84"},null,"Datum:",45,null,"Région & Datum:",{"$f":"(INDEX('Table Datum Shifts'!B15:B203,H4))","v":"France / IGN/NTF"}]
["Spheroide:",42,null,"Ellipsoïde:",{"$f":"INDEX(Spheroides!C8:C56,B5)","v":"WGS 84"},null,"Sphéroïde:",12,null,"Ellipsoïde",{"$f":"INDEX(Spheroides!C8:C56,H5)","v":"CLARKE 1880 IGN"}]
[null,null,null,"Gd Axe:",{"$f":"INDEX(Spheroides!D8:D56,B5)","v":6378137},null,null,null,null,"Gd Axe",{"$f":"INDEX(Spheroides!D8:D56,H5)","v":6378249.2000000002}]
[null,null,null,"Pt Axe:",{"$f":"INDEX(Spheroides!E8:E56,B5)","v":6356752.3140000002},null,null,null,null,"Pt Axe",{"$f":"INDEX(Spheroides!E8:E56,H5)","v":6356515}]
[null,null,null,"e2",{"$f":"INDEX(Spheroides!F8:F56,B5)","v":6.6943800667646578E-3},null,null,null,null,"e2",{"$f":"INDEX(Spheroides!F8:F56,H5)","v":6.8034876462998934E-3}]
[null,null,null,"n",{"$f":"INDEX(Spheroides!G8:G56,B5)","v":1.6792204056685965E-3},null,null,null,null,"n",{"$f":"INDEX(Spheroides!G8:G56,H5)","v":0}]
[null,null,null,"1 / f",{"$f":"INDEX(Spheroides!H8:H56,B5)","v":298.25722014342756},null,null,null,null,"1 / f",{"$f":"INDEX(Spheroides!H8:H56,H5)","v":293.46602129362691}]
[]
[]
[]
[]
[]
[null,null,null,"Datum Shifts de 1 vers 2"]
[null,null,null,"Dx",168]
[null,null,null,"Dy",60]
[null,null,null,"Dz",-320]
[null,null,null,"Rx",0]
[null,null,null,"Ry",0]
[null,null,null,"Rz",0]
[null,null,null,"ppm",54.74]
[]
["\"+0168,00;+0060,00;-0320,00;-0,000;-0,000;-0,000;+54,740\""]
[{"$f":"INDEX('Table Datum Shifts'!D15:GC203,H4,B4)","v":"\"-0168,00;-0060,00;+0320,00;-0,000;-0,000;-0,000;-54,74\""}]

{"sheet":"Conversion","index":2,"n_rows":10,"n_cols":20,"rows_kept":10,"cut":false,"hidden":false,"merged":[[6,15,6,18],[2,1,2,3],[2,4,2,9],[2,11,2,13],[2,14,2,19],[8,2,8,4],[8,6,8,8],[8,12,8,14],[8,16,8,18],[3,1,3,3],[3,4,3,9],[3,11,3,13],[3,14,3,19],[5,1,5,9],[6,1,6,4],[6,5,6,8],[6,11,6,14]]}
[]
[]
[null,"Géodésie 1",null,null,{"$f":"Geodesie!E4","v":"Monde / WGS84"},null,null,null,null,null,null,"Géodésie 2",null,null,{"$f":"Geodesie!K4","v":"France / IGN/NTF"}]
[null,"Sphéroïde",null,null,{"$f":"Geodesie!E5","v":"WGS 84"},null,null,null,null,null,null,"Sphéroïde",null,null,{"$f":"Geodesie!K5","v":"CLARKE 1880 IGN"}]
[null,{"$f":"B8+C8/60+D8/3600","v":43.164999999999999},{"$f":"CaGeLon1(B28,F28)","v":{"$error":"#NAME?"}},{"$f":"(ABS(B5)-ABS(B8))*60","v":9.8999999999999488},null,{"$f":"F8+G8/60+H8/3600","v":2.3372291666666669},null,{"$f":"(ABS(C5)-ABS(F8))*60","v":{"$error":"#NAME?"}},null,null,null,{"$f":"geoshiftlat(C10,D10,G10,H10)","v":43.164978764628266},null,{"$f":"(ABS(L5)-ABS(L8))*60","v":9.8987258776959663},null,{"$f":"geoshiftlon(C10,D10,G10,H10)","v":2.3378820495103341},null,{"$f":"(ABS(P5)-ABS(P8))*60","v":20.272922970620044}]
[null,"Coordonnées Géographiques",null,null,null,null,null,null,null,null,null,"Coordonnées Géographiques"]
[null,"Latitude",null,null,null,"Longitude",null,null,null,"Elévation",null,"Latitude",null,null,null,"Longitude",null,null,null,"Elévation"]
[null,43,9,54,{"$f":"IF(B5<0,\"S\",\"N\")","v":"N"},2,20,14.025,{"$f":"IF(F5<0,\"W\",\"E\")","v":"E"},0,null,{"$f":"TRUNC(L5,0)","v":43},{"$f":"TRUNC((ABS(L5)-ABS(L8))*60)","v":9},{"$f":"(N5-M8)*60","v":53.923552661757981},{"$f":"IF(L5<0,\"S\",\"N\")","v":"N"},{"$f":"TRUNC(P5,0)","v":2},{"$f":"TRUNC((ABS(P5)-ABS(P8))*60)","v":20},{"$f":"(R5-Q8)*60","v":16.375378237202654},{"$f":"IF(P5<0,\"W\",\"E\")","v":"E"},{"$f":"elevation2(C10,D10,G10,H10,J8)","v":304.97544554248452}]
[null,null,"Latitude",null,null,null,"Longitude",null,null,null,null,null,"Latitude",null,null,null,"Longitude"]
[null,null,{"$f":"TRUNC(B5,0)","v":43},{"$f":"ABS(B5-TRUNC(B5,0))*60","v":9.8999999999999488},{"$f":"IF(B5<0,\"S\",\"N\")","v":"N"},null,{"$f":"TRUNC(F5,0)","v":2},{"$f":"ABS(F5-F8)*60","v":20.233750000000015},{"$f":"IF(F5<0,\"W\",\"E\")","v":"E"},null,null,null,{"$f":"TRUNC(L5,0)","v":43},{"$f":"ABS(L5-TRUNC(L5,0))*60","v":9.8987258776959663},{"$f":"IF(L5<0,\"S\",\"N\")","v":"N"},null,{"$f":"TRUNC(P5,0)","v":2},{"$f":"ABS(P5-P8)*60","v":20.272922970620044},{"$f":"IF(P5<0,\"W\",\"E\")","v":"E"}]

{"sheet":"Spheroides","index":3,"n_rows":56,"n_cols":8,"rows_kept":56,"cut":false,"hidden":true,"merged":[]}
["Liste des Ellipsoides Disponibles"]
[]
[]
[]
[]
[]
[null,null,"Nom","Demi Grand","Demi Petit","e2","n","1 / f"]
[null,1,"AIRY",6377563.3959999997,6356256.909,{"$f":"POWER(1/D8*(SQRT((D8*D8)-(E8*E8))),2)","v":6.6705400741490836E-3},1.6732202503250534E-3,{"$f":"1/((D8-E8)/D8)","v":299.32496126649505}]
[null,2,"AIRY MOD",6377340.1890000002,6356034.4479999999,6.6705399807736503E-3,1.6732203054869081E-3,299.32496546352854]
[null,3,"AUSTRALIAN NATIONAL 1967/84",6378160,6356774.7189999996,6.694541915624532E-3,null,298.24999727615801]
[null,4,"BESSEL 1841",6377397.1550000003,6356078.9630000005,6.6743721749749326E-3,1.6741847868128074E-3,299.15281535132334]
[null,5,"BESSEL 1841 MOD",6377483.8650000002,6356165.3830000004,6.6743722212770787E-3,1.6741847984660181E-3,299.15281327254201]
[null,6,"BESSEL NGO",6377492.0180000002,6356173.5089999996,6.6743721420039794E-3,null,299.152816831601]
[null,7,"BESSEL RD / POTSDAM",6377397.1550000003,6356078.9630000005,6.6743721749749326E-3,null,299.15281535132334]
[null,8,"BROADCAST",6378135,6356750.5199999996,6.6943177832963279E-3,null,298.25999977553192]
[null,9,"CLARKE 1856",6378235.5999999996,6356560.1399999997,6.785145919996286E-3,null,294.26068005015861]
[null,10,"CLARKE 1866",6378206.4000000004,6356583.7999999998,6.7686579972911819E-3,1.6979156829769022E-3,294.97869821389821]
[null,11,"CLARKE 1880",6378249.1449999996,6356514.8700000001,6.8035111421552033E-3,1.7066884768653044E-3,293.46500607911531]
[null,12,"CLARKE 1880 IGN",6378249.2000000002,6356515,6.8034876462998934E-3,null,293.46602129362691]
[null,13,"CLARKE 1880 MOD",6378249.1449999996,6356514.8700000001,6.8035111421552033E-3,1.7066884768653044E-3,293.46500607911531]
[null,14,"CLARKE 1880 (PALESTINE)",6378300.7819999997,6356566.4270000001,6.803481156342152E-3,null,293.46630171450414]
[null,15,"DANISH 1876  / ANDRAE",6377104.4299999997,6355847.415,6.6555556284901502E-3,null,299.99999670697417]
[null,16,"EVEREST (INDE) METRIQUE",6377301.2429999998,6356100.2300000004,6.6378461201175376E-3,null,300.80172315352098]
[null,17,"EVEREST (MALAYA)",6377295.6639999999,6356094.6679999996,6.637846603695206E-3,null,300.80170120309049]
[null,18,"EVEREST 1830",6377276.3449999997,6356075.4129999997,6.6378466740345783E-3,1.6649922505031004E-3,300.80169801025681]
[null,19,"EVEREST 1830 (MOD.)",6377298.5609999998,6356097.5549999997,6.6378467190551368E-3,null,300.80169596669066]
[null,20,"EVEREST BORNEO",6377298.5559999999,6356097.5549999997,6.6378451614016471E-3,null,300.80176667129774]
[null,21,"EVEREST MOD.",6377304.0630000001,6356103.0389999999,6.6378466280601449E-3,null,300.80170009712441]
[null,22,"FISHER 1960 (MERCURY)",6378166,6356784.284,6.6934215001796154E-3,null,298.30000548131846]
[null,23,"FISHER 1968",6378150,6356768.3370000003,6.6934216993408307E-3,null,298.29999659054056]
[null,24,"FISCHER MOD",6378160,6356774.7189999996,6.694541915624532E-3,1.6792611404669755E-3,298.24999727615801]
[null,25,"FISHER MOD. 1960",6378155,6356773.3200000003,6.6934217738298723E-3,null,298.29999326526678]
[null,26,"GRS 67",6378160,6356774.5159999998,6.694605356917795E-3,null,298.24716616186703]
[null,27,"GRS 80",6378137,6356752.3140000002,6.6943800667646578E-3,null,298.25722014342756]
[null,28,"HELMERT 1906",6378200,6356818,6.6934746345492999E-3,1.6789925228217189E-3,298.29763352352444]
[null,29,"HOUGH",6378270,6356794.3430000003,6.7226701580694282E-3,1.6863406749730355E-3,296.99999399320365]
[null,30,"INTERNATIONAL",6378388,6356911.9460000005,6.7226700623166684E-3,1.6863406508729228E-3,296.9999982305938]
[null,31,"JEFFREYS 1948",6378099,6356631,6.7204571463943836E-3,null,297.09795975405251]
[null,32,"KRASSOVSKY",6378245,6356863,6.6934274898192208E-3,1.6789806572508061E-3,298.29973809746514]
[null,33,"PRECISE",6378145,6356759.7690000003,6.6945420073107756E-3,1.6792611635429559E-3,298.2499931845532]
[null,34,"REF ELLIPSOIDE 1967",6378160,6356774.7189999996,6.694541915624532E-3,1.6792611404669755E-3,298.24999727615801]
[null,35,"S AMERICA 1969",6378160,6356774.7189999996,6.694541915624532E-3,1.6792611404669755E-3,298.24999727615801]
[null,36,"STRUVE 1860",6378298.2999999998,6356657.1430000002,6.7743596975477745E-3,null,294.73000450022613]
[null,37,"SVANBERG",6376797,6355837.9709999999,6.5627258654816379E-3,null,304.25059290675966]
[null,38,"WAR OFFICE 1924",6378300,6356751.6890000002,6.7453433754114476E-3,null,295.99999740119182]
[null,39,"WGS 60",6378165,6356783.2869999995,6.6934216102894064E-3,null,298.30000056589779]
[null,40,"WGS 66",6378145,6356759.7690000003,6.6945420073107756E-3,null,298.2499931845532]
[null,41,"WGS 72",6378135,6356750.5199999996,6.6943177832963279E-3,1.6792047299063939E-3,298.25999977553192]
[null,42,"WGS 84",6378137,6356752.3140000002,6.6943800667646578E-3,1.6792204056685965E-3,298.25722014342756]
[null,43]
[null,44]
[null,45]
[null,46]
[]
[]
[null,null," "]

{"sheet":"Table Datum Shifts","index":4,"n_rows":203,"n_cols":186,"rows_kept":203,"cut":false,"hidden":true,"merged":[]}
["Datum System 1",null,"\"-0136,00;-0108,00;-0292,00;-0,000;-0,000;-0,000;-0,000\""]
["Datum System 2",null,"\"-0168,00;-0060,00;+0320,00;-0,000;-0,000;-0,000;-54,74\""]
[null,null,{"$f":"MID(C1,2,8)","v":"-0136,00"},{"$f":"MID(C1,11,8)","v":"-0108,00"},{"$f":"MID(C1,20,8)","v":"-0292,00"},{"$f":"MID(C1,29,6)","v":"-0,000"},{"$f":"MID(C1,36,6)","v":"-0,000"},{"$f":"MID(C1,43,6)","v":"-0,000"},{"$f":"MID(C1,50,6)","v":"-0,000"}]
[null,null,{"$f":"MID(C2,2,8)","v":"-0168,00"},{"$f":"MID(C2,11,8)","v":"-0060,00"},{"$f":"MID(C2,20,8)","v":"+0320,00"},{"$f":"MID(C2,29,6)","v":"-0,000"},{"$f":"MID(C2,36,6)","v":"-0,000"},{"$f":"MID(C2,43,6)","v":"-0,000"},{"$f":"MID(C2,50,6)","v":"-54,74"}]
[null,null,{"$f":"C3-C4","v":32},-48,-612,0,0,0,54.74]
[null,null,{"$f":"ABS(C5)","v":32},48,612,0,0,0,54.74]
[null,null,{"$f":"TEXT(C6,\"0000,00\")","v":"0032,00"},{"$f":"TEXT(D6,\"0000,00\")","v":"0048,00"},{"$f":"TEXT(E6,\"0000,00\")","v":"0612,00"},{"$f":"TEXT(F6,\"0,000\")","v":"0,000"},{"$f":"TEXT(G6,\"0,000\")","v":"0,000"},{"$f":"TEXT(H6,\"0,000\")","v":"0,000"},{"$f":"TEXT(I6,\"0,000\")","v":"54,740"}]
[null,null,{"$f":"IF(C5>0,CONCATENATE(\"+\",C7),CONCATENATE(\"-\",C7))","v":"+0032,00"},"-0048,00","-0612,00","-0,000","-0,000","-0,000","+54,740"]
[null,null,{"$f":"CONCATENATE(\"\"\"\",C8,\";\")","v":"\"+0032,00;"},{"$f":"CONCATENATE(D8,\";\")","v":"-0048,00;"},{"$f":"CONCATENATE(E8,\";\")","v":"-0612,00;"},{"$f":"CONCATENATE(F8,\";\")","v":"-0,000;"},{"$f":"CONCATENATE(G8,\";\")","v":"-0,000;"},{"$f":"CONCATENATE(H8,\";\")","v":"-0,000;"},{"$f":"CONCATENATE(I8,\"\"\"\")","v":"+54,740\""}]
["Datum Calcule",null,{"$f":"CONCATENATE(C9,D9,E9,F9,G9,H9,I9)","v":"\"+0032,00;-0048,00;-0612,00;-0,000;-0,000;-0,000;+54,740\""}]
[]
[null,null,null,"Vers","Vers","Vers","Vers","Vers","Vers","Vers","Vers","Vers","Vers","Vers","Vers","Vers","Vers","Vers","Vers","Vers","Vers","Vers","Vers","Vers",null,"Vers","Vers","Vers","Vers",null,"Vers","Vers","Vers","Vers",null,"Vers","Vers","Vers","Vers","Vers",null,"Vers","Vers","Vers","Vers",null,"Vers","Vers","Vers","Vers","Vers","Vers",null,"Vers","Vers","Vers","Vers","Vers","Vers","Vers","Vers","Vers",null,"Vers",null,"Vers",null,null,null,null,"Vers",null,null,"Vers",null,"Vers",null,"Vers","Vers","Vers",null,"Vers","Vers","Vers","Vers",null,"Vers","Vers","Vers","Vers",null,"Vers","Vers",null,null,null,"Vers","Vers","Vers","Vers","Vers","Vers",null,"Vers",null,null,null,"Vers","Vers","Vers","Vers","Vers",null,null,null,"Vers",null,"Vers","Vers","Vers","Vers","Vers","Vers","Vers","Vers","Vers","Vers","Vers","Vers","Vers","Vers","Vers","Vers","Vers",null,"Vers","Vers","Vers","Vers","Vers",null,"Vers","Vers","Vers","Vers","Vers","Vers","Vers",null,"Vers","Vers","Vers",null,"Vers","Vers","Vers","Vers","Vers","Vers","Vers","Vers","Vers","Vers","Vers","Vers","Vers","Vers","Vers","Vers","Vers",null,"Vers","Vers","Vers","Vers","Vers","Vers","Vers","Vers","Vers","Vers","Vers","Vers","Vers"]
[null,null,"Zone / Datum","Monde / WGS84","Afrique du Sud / S Africa Cape","Alaska / NAD27","Alaska / NAD27","Alaska / NAD83","Amerique Central / NAD83","Arabie Saoudite / Nahrwan","Argentine / Campo Inchauste","Argentine / S. America 1969","Australie / Australian Geodetic 1966","Australie / Australian Nat","Australie / Autralian","Bahrain / Ain El Abl 1970","Bangladesh / Indian","Belize / NAD27","Bolivie / Prov. S America 1956","Bolivie / S. America 1969","Botswana / Cape Arc 1950","Bresil / S. America 1969","Brunei / Timbalai","Canada / NAD27","Canada / NAD27 (Canada)","Canal Panama / NAD27","Chili / Prov. S Chilean 63","Chili / S. America 1969","Chypre / ED50","Colombie / Bogota Observatory","Colombie / Prov. S America 1956","Colombie / S. America 1969","Corée / Tokyo","Egypte / ED50","Egypte / Old Egyptian","Emirats Arabes Unifies / Nahrwan","Equateur / Prov. S American 1956","Equateur / S American 1969","Erytree / Massawa","Espagne / ED50","Espiranto Santos / Santo (DOS)","Ethiopie / Adindan","Europe / ED50","Europe / ED87","Finlande / ED50","France / ED50 IGN","France / ED79 France","France / IGN/NTF","France / WGS72 France","Gabon / M'Paraloko","Gizo / Gizo DOS 1968","Grece / ED50","Groenland / NAD27","Groenland / Qornoq","Guatemala / NAD27","Guyana / Prov. S American 1956","Guyana / S American 1969","Honduras / NAD27","Hong Kong / Hong Kong 1963","Icelande / Hjorsey 1955","Ile d'Efate et Erromango / Bellevue (IGN)","Ile d'Oahu / ?","Ile de Costa Rica / NAD27","Ile de Cuba / NAD27","Ile de Guam / Guam 1963","Ile de Kerguelen / Kerguelen","Ile de l'Ascension / Ascension 1958","Ile de la Barbades / NAD27","Ile de la Jamaique / NAD27","Ile de Madere / SE Base","Ile de Sao Miguel / Sao Braz","Ile de Sardaigne / ED50","Ile de Sardaigne / Rome 1940","Ile de Sicile / ED50","Ile de Tern / Asrto B4","Ile Diego Garcia / ISTS 073 Astro 1969","Ile Dominique / NAD27","Ile Georgia / DOS 1968","Ile Grand Cayman / NAD27","Ile Guadalcanal / Gux 1 Astro","Ile Hawaii / Old Hawaiian","Ile Hawaii Kauai / Old Hawaiian","Ile Hawaii Maui / Old Hawaiian","Ile Hawaii Oahu / Old Hawaiian","Ile Iwo Jima / Astro Beacon East","Ile Johnson / Johnson Is 1961","Ile Mahe / Ile Mahe 1971","Ile Marcus / Asrto Stn 1952","Ile Pitcairn / Pitcairn Astro 1967","Ile Saint Helene / Astro DOS 7","Ile Santa Maria / Sao Braz","Ile Tristan da Cunha / Tristan Astro","Ile Viti Levu / Viti Levu 1916","Iles Bahamas / Cape Canaveral","Iles Bahamas / NAD27","Iles Caicos / NAD27","Iles Caiman / LC 5 Astro","Iles Canaries / Pico de las Nieves","Iles Chatam / Ile Chatam 1971","Iles Cocos / Australian","Iles de Mascarenes / Reunion","Iles de Midway / Midway Astro 1961","Iles de Paques / Iles de Paques 1967","Iles des Açores / Observatorio 1966","Iles des Açores / SW Base","Iles des Bermudes / Bermuda 1957","Iles Falklands / Sapper Hill 1943","Iles Maldives / Gandajika Base","Iles Marshall / Wake Eniwetok 1960","Iles Phoenix / Canton Astro 1966","Iles Salvages / Marco Astro","Iles Sous le Vent / NAD27","Iles Trinité & Tobago / Naparima (BWI)","Iles Trinité & Tobago / S. American 1969","Iles Vierges / Puerto Rico","Iran / ED50","Irelande / Ireland 1965","Japon / Tokyo","Kenya / Cape Arc 1950","Lesoto / Cape Arc 1950","Liberia / Liberia 1964","Malaisie (Est) / Timbalia","Malaisie (Ouest) / Kertau 1948","Malawi / Cape Arc 1950","Mali / Adindan","Maroc / Merchich","Maui / Maui","Mexique / NAD27","Mindanao / Luzon","Monde / DOPLER","Monde / NWL 10D","Monde / NWL 9D","Monde / WGS 72","Monde / WGS84 SEA","Namibie / Schwarzeck","Neherlandes / RD","Nepal / Indian","Nicaragua / NAD27","Nigeria / Minna","Norvège / ED50","Nouvelles Zelandes / GD 1949","Oman / Oman","Paraguay / Chua Astro","Paraguay / S American 1969","Perou / Prov S American 1956","Perou / S American 1969","Phillipines / Luzon 1911","Portugal / ED50","Puerto Rico / Puerto Rico","Qatar / Nahrwan","Qatar / Nahrwan Maersk","Qatar / Qatar National","Royaume Uni / DOPPLER","Royaume Uni / ED50","Royaume Uni / OS(SN)80","Russie / Pulkovo","Russie / WGS72","Sabah / Timbalai 1948","San Salvador / NAD27","Sarawak / Timbalai 1948","Senegal / Adindan","Singapour / Kertau 1948","Singapour / Kertau 1948","Singapour / South Asia","Somalie / Afgooye","Soudan / Adindan","Sri Lanka / Kandawala","Sumatra / Djakarta (Batavia)","Surinam / Zanderij","Swaziland / Cape Arc 1950","Tanzanie / Cale Arc 1950","Tasmanie / Australian National","Thailande / Indian","Thailande / Moattama","Tunisie / Carthage","Turquie / NAD27","USA / NAD27 (CONUS)","Venezuela / Prov. S. American 1956","Venezuela / S. American 1969","Vietnam / Indian","Zaire / Cape Arc 1950","Zambie / Cape Arc 1950","Zimbabwe / Cape Arc 1950"," / "," / "," / "]
[null,"Zone / Datum","Spheroide","WGS84","Clarke 1880 Mod.","Clarke 1866","Clarke 1866","GRS80","GRS80","Clarke 1880 Mod.","International","S America 1969","RE 1967","RE 1967","RE 1984","International","Everest 1830","Clarke 1866","International","S. America 1969","Clarke 1880 Mod.","S. America 1969","Everest 1830","Clarke 1866","Clarke 1866","Clarke 1866","International","S. America 1969","International","International","International","S. America 1969","Bessel 1841","International","Helmert 1906","Clarke 1880 Mod","International","S American 1969","Bessel 1841","International","International","Clarke 1880 Mod","International","International","International","International","International","Clarke 1880 (IGN)","WGS72","Clarke 1880","International","International","Clarke 1866","International","Clarke 1866","International","S American","Clarke 1866","International","International","International","Clarke 1866","Clarke 1866","Clarke 1866","Clarke 1966","International","International","Clarke 1866","Clarke 1866","International","International","International","International","International","International","International","Clarke 1866","International","Clarke 1866","International","Clarke 1866","Clarke 1866","Clarke 1866","Clarke 1866","International","International","Clarke 1880 Mod","International","International","International","International","International","Clarke 1880 Mod","Clarke 1866","Clarke 1866","Clarke 1866","Clarke 1866","International","International","RE 1967","International","International","International","International","International","Clarke 1866","International","International","Hough","International","International","Clarke 1866","International","S. American 1969","Clarke 1866","International","Airy Mod","Bessel 1841","Clarke 1880 Mod","Clarke 1880 Mod","Clarke 1880 Mod","Everest 1830","Everest Mod","Clarke 1880 Mod","Clarke 1880 Mod","Clarke 1880 Mod","Clarke 1866","Clarke 1866","Clarke 1866","Precise","NWL 10D","NWL 9D","WGS 72","WGS84","Bessel 1841 Mod","Bessel RD","Everst 1830","Clarke 1866","Clarke 1880 Mod","International","International","Clarke 1880 Mod","International","S American 1969","International","S American 1969","Clarke 1866","International","Clarke 1866","Clarke 1880 Mod","Clarke 1880 Mod","International","Precise","International","Airy","Krassovsky","WGS72","Everest 1830","Clarke 1866","Everst 1830","Clarke 1880 Mod","Everest Mod","Everest 1830","Fisher Mod","Krassovsky","Clarke 1880 Mod","Everest 1830","Bessel 1841","International","Clarke 1880 Mod","Clarke 1880 Mod","RE 1967","Everest 1830","WGS84","Clarke 1880 Mod","Clarke 1866","Clarke 1866","International","S. American 1969","Everest 1830","Clarke 1880 Mod","Clarke 1880 Mod","Clarke 1880 Mod"]
["Depuis","Monde / WGS84","WGS84","\"-0000,00;-0000,00;-0000,00;-0,000;-0,000;-0,000;-0,000\"","\"+0136,00;+0108,00;+0292,00;-0,000;-0,000;-0,000;-0,000\"","\"+0012,62;-0156,56;-0180,52;-0,000;-0,000;-0,814;-0,427\"","\"+0005,00;-0135,00;-0172,00;-0,000;-0,000;-0,000;-0,000\"","\"-0000,00;-0000,00;-0000,00;-0,000;-0,000;-0,000;-0,000\"","\"-0000,00;-0000,00;-0000,00;-0,000;-0,000;-0,000;-0,000\"","\"+0231,00;+0196,00;-0482,00;-0,000;-0,000;-0,000;-0,000\"","\"+0148,00;-0136,00;-0090,00;-0,000;-0,000;-0,000;-0,000\"","\"+0057,00;-0001,00;+0041,00;-0,000;-0,000;-0,000;-0,000\"","\"+0133,00;+0048,00;-0148,00;-0,000;-0,000;-0,000;-0,000\"","\"+0122,00;+0041,00;-0150,00;-0,000;-0,000;-0,554;-0,227\"","\"+0134,00;+0048,00;-0149,00;-0,000;-0,000;-0,000;-0,000\"","\"+0150,00;+0251,00;+0002,00;-0,000;-0,000;-0,000;-0,000\"","\"-0289,00;-0734,00;-0257,00;-0,000;-0,000;-0,000;-0,000\"","\"-0000,00;-0125,00;-0194,00;-0,000;-0,000;-0,000;-0,000\"","\"+0288,00;-0175,00;+0376,00;-0,000;-0,000;-0,000;-0,000\"","\"+0057,00;-0001,00;+0041,00;-0,000;-0,000;-0,000;-0,000\"","\"+0138,00;+0105,00;+0289,00;-0,000;-0,000;-0,000;-0,000\"","\"+0057,00;-0001,00;+0041,00;-0,000;-0,000;-0,000;-0,000\"","\"+0689,00;-0691,00;+0046,00;-0,000;-0,000;-0,000;-0,000\"","\"+0010,00;-0158,00;-0187,00;-0,000;-0,000;-0,000;-0,000\"","\"+0009,00;-0139,00;-0177,50;-0,000;-0,000;-0,554;-0,227\"","\"-0000,00;-0125,00;-0201,00;-0,000;-0,000;-0,000;-0,000\"","\"-0016,00;-0196,00;-0093,00;-0,000;-0,000;-0,000;-0,000\"","\"+0057,00;-0001,00;+0041,00;-0,000;-0,000;-0,000;-0,000\"","\"+0104,00;+0101,00;+0140,00;-0,000;-0,000;-0,000;-0,000\"","\"-0307,00;-0304,00;+0318,00;-0,000;-0,000;-0,000;-0,000\"","\"+0288,00;-0175,00;+0376,00;-0,000;-0,000;-0,000;-0,000\"","\"+0057,00;-0001,00;+0041,00;-0,000;-0,000;-0,000;-0,000\"","\"+0128,00;-0481,00;-0664,00;-0,000;-0,000;-0,000;-0,000\"","\"+0130,00;+0117,00;+0151,00;-0,000;-0,000;-0,000;-0,000\"","\"+0130,00;-0110,00;+0013,00;-0,000;-0,000;-0,000;-0,000\"","\"+0249,00;+0156,00;-0381,00;-0,000;-0,000;-0,000;-0,000\"","\"+0288,00;-0175,00;+0376,00;-0,000;-0,000;-0,000;-0,000\"","\"+0057,00;-0001,00;+0041,00;-0,000;-0,000;-0,000;-0,000\"","\"-0639,00;-0405,00;-0060,00;-0,000;-0,000;-0,000;-0,000\"","\"+0088,00;+0109,00;+0122,00;-0,000;-0,000;-0,000;-0,000\"","\"-0170,00;-0042,00;-0084,00;-0,000;-0,000;-0,000;-0,000\"","\"+0165,00;+0011,00;-0206,00;-0,000;-0,000;-0,000;-0,000\"","\"+0089,50;+0093,80;+0123,10;-0,000;-0,000;+0,156;-1,200\"","\"+0083,11;+0097,38;+0117,23;+0,006;+0,045;-0,044;-0,122\"","\"+0087,00;+0095,00;+0120,00;-0,000;-0,000;-0,000;-0,000\"","\"+0084,00;+0097,00;+0117,00;-0,000;-0,000;-0,000;+14,190\"","\"+0083,00;+0095,00;+0116,00;-0,000;-0,000;-0,000;+14,190\"","\"+0168,00;+0060,00;-0320,00;-0,000;-0,000;-0,000;+54,740\"","\"-0000,00;-0012,00;-0006,00;-0,000;-0,000;-0,000;-0,031\"","\"+0077,90;+0132,90;-0043,70;-0,000;-0,000;-0,000;-0,000\"","\"-0230,00;+0199,00;+0752,00;-0,000;-0,000;-0,000;-0,000\"","\"+0084,00;+0095,00;+0130,00;-0,000;-0,000;-0,000;-0,000\"","\"-0011,00;-0114,00;-0195,00;-0,000;-0,000;-0,000;-0,000\"","\"-0164,00;-0138,00;+0189,00;-0,000;-0,000;-0,000;-0,000\"","\"-0000,00;-0125,00;-0194,00;-0,000;-0,000;-0,000;-0,000\"","\"+0288,00;-0175,00;+0376,00;-0,000;-0,000;-0,000;-0,000\"","\"+0057,00;-0001,00;+0041,00;-0,000;-0,000;-0,000;-0,000\"","\"-0000,00;-0125,00;-0194,00;-0,000;-0,000;-0,000;-0,000\"","\"+0156,00;+0271,00;+0189,00;-0,000;-0,000;-0,000;-0,000\"","\"+0073,00;-0046,00;+0086,00;-0,000;-0,000;-0,000;-0,000\"","\"+0127,00;+0769,00;-0472,00;-0,000;-0,000;-0,000;-0,000\"","\"-0056,00;+0268,00;+0182,50;-0,000;-0,000;-0,554;-0,227\"","\"-0000,00;-0125,00;-0194,00;-0,000;-0,000;-0,000;-0,000\"","\"+0007,00;-0152,00;-0178,00;-0,000;-0,000;-0,000;-0,000\"","\"-0252,00;+0209,00;+0751,00;-0,000;-0,000;-0,000;-0,000\"","\"-0145,00;+0187,00;-0103,00;-0,000;-0,000;-0,000;-0,000\"","\"+0207,00;-0107,00;-0052,00;-0,000;-0,000;-0,000;-0,000\"","\"+0007,00;-0152,00;-0178,00;-0,000;-0,000;-0,000;-0,000\"","\"+0007,00;-0152,00;-0178,00;-0,000;-0,000;-0,000;-0,000\"","\"+0499,00;+0249,00;-0314,00;-0,000;-0,000;-0,000;-0,000\"","\"+0203,00;-0141,00;-0053,00;-0,000;-0,000;-0,000;-0,000\"","\"+0097,00;+0103,00;+0120,00;-0,000;-0,000;-0,000;-0,000\"","\"+0255,00;+0065,00;-0009,00;-0,000;-0,000;-0,000;-0,000\"","\"+0097,00;+0088,00;+0135,00;-0,000;-0,000;-0,000;-0,000\"","\"-0114,00;+0116,00;+0333,00;-0,000;-0,000;-0,000;-0,000\"","\"-0208,00;+0435,00;+0229,00;-0,000;-0,000;-0,000;-0,000\"","\"+0007,00;-0152,00;-0178,00;-0,000;-0,000;-0,000;-0,000\"","\"-0230,00;+0199,00;+0752,00;-0,000;-0,000;-0,000;-0,000\"","\"+0007,00;-0152,00;-0178,00;-0,000;-0,000;-0,000;-0,000\"","\"-0252,00;+0209,00;+0751,00;-0,000;-0,000;-0,000;-0,000\"","\"-0089,00;+0279,00;+0183,00;-0,000;-0,000;-0,000;-0,000\"","\"-0045,00;+0290,00;+0172,00;-0,000;-0,000;-0,000;-0,000\"","\"-0065,00;+0290,00;+0190,00;-0,000;-0,000;-0,000;-0,000\"","\"-0056,00;+0284,00;+0181,00;-0,000;-0,000;-0,000;-0,000\"","\"-0145,00;-0075,00;+0272,00;-0,000;-0,000;-0,000;-0,000\"","\"-0191,00;+0077,00;+0204,00;-0,000;-0,000;-0,000;-0,000\"","\"-0041,00;+0220,00;+0134,00;-0,000;-0,000;-0,000;-0,000\"","\"-0124,00;+0234,00;+0025,00;-0,000;-0,000;-0,000;-0,000\"","\"-0185,00;-0165,00;-0042,00;-0,000;-0,000;-0,000;-0,000\"","\"+0320,00;-0550,00;+0494,00;-0,000;-0,000;-0,000;-0,000\"","\"+0203,00;-0141,00;-0053,00;-0,000;-0,000;-0,000;-0,000\"","\"+0632,00;-0438,00;+0609,00;-0,000;-0,000;-0,000;-0,000\"","\"-0051,00;-0391,00;+0036,00;-0,000;-0,000;-0,000;-0,000\"","\"+0002,00;-0150,00;-0181,00;-0,000;-0,000;-0,000;-0,000\"","\"+0004,00;-0154,00;-0178,00;-0,000;-0,000;-0,000;-0,000\"","\"+0007,00;-0152,00;-0178,00;-0,000;-0,000;-0,000;-0,000\"","\"-0042,00;-0124,00;-0147,00;-0,000;-0,000;-0,000;-0,000\"","\"+0307,00;+0092,00;-0127,00;-0,000;-0,000;-0,000;-0,000\"","\"-0175,00;+0038,00;-0113,00;-0,000;-0,000;-0,000;-0,000\"","\"+0491,00;+0022,00;-0435,00;-0,000;-0,000;-0,000;-0,000\"","\"-0094,00;+0948,00;+1262,00;-0,000;-0,000;-0,000;-0,000\"","\"-0912,00;+0058,00;-1227,00;-0,000;-0,000;-0,000;-0,000\"","\"-0211,00;-0147,00;-0111,00;-0,000;-0,000;-0,000;-0,000\"","\"+0425,00;+0169,00;-0081,00;-0,000;-0,000;-0,000;-0,000\"","\"+0104,00;-0167,00;+0038,00;-0,000;-0,000;-0,000;-0,000\"","\"+0073,00;-0213,00;-0296,00;-0,000;-0,000;-0,000;-0,000\"","\"+0355,00;-0016,00;-0074,00;-0,000;-0,000;-0,000;-0,000\"","\"+0133,00;+0321,00;-0050,00;-0,000;-0,000;-0,000;-0,000\"","\"-0101,00;-0052,00;+0039,00;-0,000;-0,000;-0,000;-0,000\"","\"-0298,00;+0304,00;+0375,00;-0,000;-0,000;-0,000;-0,000\"","\"+0289,00;+0124,00;-0060,00;-0,000;-0,000;-0,000;-0,000\"","\"+0007,00;-0152,00;-0178,00;-0,000;-0,000;-0,000;-0,000\"","\"+0002,00;-0374,00;-0172,00;-0,000;-0,000;-0,000;-0,000\"","\"+0057,00;-0001,00;+0041,00;-0,000;-0,000;-0,000;-0,000\"","\"-0011,00;-0072,00;+0101,00;-0,000;-0,000;-0,000;-0,000\"","\"+0117,00;+0132,00;+0164,00;-0,000;-0,000;-0,000;-0,000\"","\"-0506,00;+0122,00;-0611,00;-0,000;-0,000;-0,000;-0,000\"","\"+0128,00;-0481,00;-0664,00;-0,000;-0,000;-0,000;-0,000\"","\"+0161,00;+0007,00;+0300,00;-0,000;-0,000;-0,000;-0,000\"","\"+0125,00;+0108,00;+0295,00;-0,000;-0,000;-0,000;-0,000\"","\"+0090,00;-0040,00;-0088,00;-0,000;-0,000;-0,000;-0,000\"","\"+0689,00;-0691,00;+0046,00;-0,000;-0,000;-0,000;-0,000\"","\"+0011,00;-0851,00;-0005,00;-0,000;-0,000;-0,000;-0,000\"","\"+0161,00;+0073,00;+0317,00;-0,000;-0,000;-0,000;-0,000\"","\"+0163,00;+0020,00;-0220,00;-0,000;-0,000;-0,000;-0,000\"","\"-0031,00;-0146,00;-0047,00;-0,000;-0,000;-0,000;-0,000\"","\"-0065,00;+0272,00;+0192,50;-0,000;-0,000;-0,554;-0,227\"","\"+0012,00;-0130,00;-0190,00;-0,000;-0,000;-0,000;-0,000\"","\"+0133,00;+0079,00;+0072,00;-0,000;-0,000;-0,000;-0,000\"","\"-0000,00;-0000,00;-0004,50;-0,000;-0,000;-0,814;+0,600\"","\"-0000,00;-0000,00;-0004,50;-0,000;-0,000;-0,814;+0,602\"","\"-0000,00;-0000,00;-0004,50;-0,000;-0,000;-0,814;+0,600\"","\"-0000,00;-0000,00;-0004,50;-0,000;-0,000;-0,554;-0,227\"","\"-0000,00;-0000,00;-0000,00;-0,000;-0,000;-0,000;-0,000\"","\"-0616,00;-0097,00;+0251,00;-0,000;-0,000;-0,000;-0,000\"",null,"\"-0289,00;-0734,00;-0257,00;-0,000;-0,000;-0,000;-0,000\"","\"-0000,00;-0125,00;-0194,00;-0,000;-0,000;-0,000;-0,000\"","\"+0092,00;+0093,00;-0122,00;-0,000;-0,000;-0,000;-0,000\"","\"+0087,00;+0095,00;+0120,00;-0,000;-0,000;-0,000;-0,000\"","\"-0084,00;+0022,00;-0209,00;-0,000;-0,000;-0,000;-0,000\"","\"+0346,00;+0001,00;-0224,00;-0,000;-0,000;-0,000;-0,000\"","\"+0134,00;-0229,00;+0029,00;-0,000;-0,000;-0,000;-0,000\"","\"+0057,00;-0001,00;+0041,00;-0,000;-0,000;-0,000;-0,000\"","\"+0288,00;-0175,00;+0376,00;-0,000;-0,000;-0,000;-0,000\"","\"+0057,00;-0001,00;+0041,00;-0,000;-0,000;-0,000;-0,000\"","\"+0133,00;+0077,00;+0051,00;-0,000;-0,000;-0,000;-0,000\"","\"+0088,00;+0109,00;+0122,00;-0,000;-0,000;-0,000;-0,000\"","\"-0011,00;-0072,00;+0101,00;-0,000;-0,000;-0,000;-0,000\"","\"+0249,17;+0152,09;-0391,46;-0,000;-0,000;-0,000;-0,000\"","\"+0250,20;+0153,09;-0391,70;-0,000;-0,000;-0,000;-0,000\"","\"+0128,16;+0282,42;-0021,93;-0,000;-0,000;-0,000;-0,000\"",null,"\"+0086,00;+0096,00;+0120,00;-0,000;-0,000;-0,000;-0,000\"","\"-0364,71;+0109,42;-0429,00;-0,000;-0,000;+0,156;-1,198\"",null,null,"\"+0689,00;-0691,00;+0046,00;-0,000;-0,000;-0,000;-0,000\"","\"-0001,00;-0140,00;-0165,00;-0,000;-0,000;-0,000;-0,000\"","\"+0689,00;-0691,00;+0046,00;-0,000;-0,000;-0,000;-0,000\"","\"+0128,00;+0018,00;-0224,00;-0,000;-0,000;-0,000;-0,000\"","\"+0011,00;-0851,00;-0005,00;-0,000;-0,000;-0,000;-0,000\"","\"-0008,21;-0861,39;-0001,31;-0,000;-0,000;-0,814;+0,380\"","\"-0007,00;+0010,00;+0026,00;-0,000;-0,000;-0,000;-0,000\"","\"+0043,00;+0163,00;-0045,00;-0,000;-0,000;-0,000;-0,000\"","\"+0161,00;+0014,00;-0205,00;-0,000;-0,000;-0,000;-0,000\"","\"+0097,00;-0787,00;-0086,00;-0,000;-0,000;-0,000;-0,000\"","\"+0377,00;-0681,00;+0050,00;-0,000;-0,000;-0,000;-0,000\"","\"+0265,00;-0120,00;+0358,00;-0,000;-0,000;-0,000;-0,000\"","\"+0134,00;+0105,00;+0295,00;-0,000;-0,000;-0,000;-0,000\"","\"+0158,00;+0012,00;+0299,00;-0,000;-0,000;-0,000;-0,000\"","\"+0134,00;+0048,00;-0149,00;-0,000;-0,000;-0,000;-0,000\"","\"-0214,00;-0836,00;-0303,00;-0,000;-0,000;-0,000;-0,000\"","\"+0004,69;-0008,50;-0002,89;-0,000;-0,000;-0,000;-0,000\"","\"+0263,00;-0006,00;-0431,00;-0,000;-0,000;-0,000;-0,000\"","\"+0007,00;-0152,00;-0178,00;-0,000;-0,000;-0,000;-0,000\"","\"+0022,00;-0157,00;-0180,50;-0,000;-0,000;-0,554;-0,227\"","\"+0288,00;-0175,00;+0376,00;-0,000;-0,000;-0,000;-0,000\"","\"+0057,00;-0001,00;+0041,00;-0,000;-0,000;-0,000;-0,000\"","\"-0289,00;-0734,00;-0257,00;-0,000;-0,000;-0,000;-0,000\"","\"+0169,00;+0019,00;+0278,00;-0,000;-0,000;-0,000;-0,000\"","\"+0147,00;+0074,00;+0283,00;-0,000;-0,000;-0,000;-0,000\"","\"+0142,00;+0096,00;+0293,00;-0,000;-0,000;-0,000;-0,000\""]
["Depuis","Afrique du Sud / S Africa Cape","Clarke 1880 Mod.","\"-0136,00;-0108,00;-0292,00;-0,000;-0,000;-0,000;-0,000\""]
["Depuis","Alaska / NAD27","Clarke 1866","\"-0012,62;+0156,56;+0180,52;-0,000;-0,000;+0,814;+0,427\""]
["Depuis","Alaska / NAD27","Clarke 1866","\"-0005,00;+0135,00;+0172,00;-0,000;-0,000;-0,000;-0,000\""]
["Depuis","Alaska / NAD83","GRS80","\"-0000,00;-0000,00;-0000,00;-0,000;-0,000;-0,000;-0,000\""]
["Depuis","Amerique Central / NAD83","GRS80","\"-0000,00;-0000,00;-0000,00;-0,000;-0,000;-0,000;-0,000\""]
["Depuis","Arabie Saoudite / Nahrwan","Clarke 1880 Mod.","\"-0231,00;-0196,00;+0482,00;-0,000;-0,000;-0,000;-0,000\""]
["Depuis","Argentine / Campo Inchauste","International","\"-0148,00;+0136,00;+0090,00;-0,000;-0,000;-0,000;-0,000\""]
["Depuis","Argentine / S. America 1969","S America 1969","\"-0057,00;+0001,00;-0041,00;-0,000;-0,000;-0,000;-0,000\""]
["Depuis","Australie / Australian Geodetic 1966","RE 1967","\"-0133,00;-0048,00;+0148,00;-0,000;-0,000;-0,000;-0,000\""]
["Depuis","Australie / Australian Nat","RE 1967","\"-0122,00;-0041,00;+0150,00;-0,000;-0,000;+0,554;+0,227\"",null,null,null,null,null,null,null,null,null,null,null,null,null,null,null,null,null,null,null,null,null,null,null,null,null,null,null,null,null,null,null,null,null,null,null,null,null,null,null,null,null,null,null,null,null,null,null,null,null,null,null,null,null,null,null,null,null,null,null,null,null,null,null,null,null,null,null,null,null,null,null,null,null,null,null,null,null,null,null,null,null,null,null,null,null,null,null,null,null,null,null,null,null,null,null,null,null,null,null,null,null,null,null,null,null,null,null,null,null,null,null,null,null,null,null,null,null,null,null,null,null,null,null,null,null,null,null,null,"\"-0122,00;-0041,00;+0146,00;-0,000;-0,000;-0,000;-0,000\""]
["Depuis","Australie / Autralian","RE 1984","\"-0134,00;-0048,00;+0149,00;-0,000;-0,000;-0,000;-0,000\""]
["Depuis","Bahreïn / Ain El Abl 1970","International","\"-0150,00;-0251,00;-0002,00;-0,000;-0,000;-0,000;-0,000\""]
["Depuis","Bangladesh / Indian","Everest 1830","\"+0289,00;+0734,00;+0257,00;-0,000;-0,000;-0,000;-0,000\""]
["Depuis","Belize / NAD27","Clarke 1866","\"-0000,00;+0125,00;+0194,00;-0,000;-0,000;-0,000;-0,000\""]
["Depuis","Bolivie / Prov. S America 1956","International","\"-0288,00;+0175,00;-0376,00;-0,000;-0,000;-0,000;-0,000\""]
["Depuis","Bolivie / S. America 1969","S. America 1969","\"-0057,00;+0001,00;-0041,00;-0,000;-0,000;-0,000;-0,000\""]
["Depuis","Botswana / Cape Arc 1950","Clarke 1880 Mod","\"-0138,00;-0105,00;-0289,00;-0,000;-0,000;-0,000;-0,000\""]
["Depuis","Bresil / S. America 1969","S. America 1969","\"-0057,00;+0001,00;-0041,00;-0,000;-0,000;-0,000;-0,000\""]
["Depuis","Brunei / Timbalai","Everest 1830","\"-0689,00;+0691,00;-0046,00;-0,000;-0,000;-0,000;-0,000\""]
["Depuis","Canada / NAD27","Clarke 1866","\"-0010,00;+0158,00;+0187,00;-0,000;-0,000;-0,000;-0,000\""]
[null,"Canada / NAD27 (Canada)","Clarke 1866","\"-0009,00;+0139,00;+0177,50;-0,000;-0,000;+0,554;+0,227\"",null,null,null,null,null,null,null,null,null,null,null,null,null,null,null,null,null,null,null,null,null,null,null,null,null,null,null,null,null,null,null,null,null,null,null,null,null,null,null,null,null,null,null,null,null,null,null,null,null,null,null,null,null,null,null,null,null,null,null,null,null,null,null,null,null,null,null,null,null,null,null,null,null,null,null,null,null,null,null,null,null,null,null,null,null,null,null,null,null,null,null,null,null,null,null,null,null,null,null,null,null,null,null,null,null,null,null,null,null,null,null,null,null,null,null,null,null,null,null,null,null,null,null,null,null,null,null,null,"\"-0009,00;+0139,00;+0173,00;-0,000;-0,000;-0,000;-0,000\""]
["Depuis","Canal Panama / NAD27","Clarke 1866","\"-0000,00;+0125,00;+0201,00;-0,000;-0,000;-0,000;-0,000\""]
["Depuis","Chili / Prov. S Chilean 63","International","\"+0016,00;+0196,00;+0093,00;-0,000;-0,000;-0,000;-0,000\""]
["Depuis","Chili / S. America 1969","S. America 1969","\"-0057,00;+0001,00;-0041,00;-0,000;-0,000;-0,000;-0,000\""]
[null,"Chypre / ED50","International","\"-0104,00;-0101,00;-0140,00;-0,000;-0,000;-0,000;-0,000\""]
["Depuis","Colombie / Bogota Observatory","International","\"+0307,00;+0304,00;-0318,00;-0,000;-0,000;-0,000;-0,000\""]
["Depuis","Colombie / Prov. S America 1956","International","\"-0288,00;+0175,00;-0376,00;-0,000;-0,000;-0,000;-0,000\""]
["Depuis","Colombie / S. America 1969","S. America 1969","\"-0057,00;+0001,00;-0041,00;-0,000;-0,000;-0,000;-0,000\""]
["Depuis","Corée / Tokyo","Bessel 1841","\"-0128,00;+0481,00;+0664,00;-0,000;-0,000;-0,000;-0,000\""]
[null,"Egypte / ED50","International","\"-0130,00;-0117,00;-0151,00;-0,000;-0,000;-0,000;-0,000\""]
["Depuis","Egypte / Old Egyptian","Helmert 1906","\"-0130,00;+0110,00;-0013,00;-0,000;-0,000;-0,000;-0,000\""]
["Depuis","Emirats Arabes Unifies / Nahrwan","Clarke 1880 Mod","\"-0249,00;-0156,00;+0381,00;-0,000;-0,000;-0,000;-0,000\""]
["Depuis","Equateur / Prov. S American 1956","International","\"-0288,00;+0175,00;-0376,00;-0,000;-0,000;-0,000;-0,000\""]
["Depuis","Equateur / S American 1969","S American 1969","\"-0057,00;+0001,00;-0041,00;-0,000;-0,000;-0,000;-0,000\""]
["Depuis","Erytree / Massawa","Bessel 1841","\"+0639,00;+0405,00;+0060,00;-0,000;-0,000;-0,000;-0,000\""]
[null,"Espagne / ED50","International","\"-0088,00;-0109,00;-0122,00;-0,000;-0,000;-0,000;-0,000\""]
["Depuis","Espiranto Santos / Santo (DOS)","International","\"+0170,00;+0042,00;+0084,00;-0,000;-0,000;-0,000;-0,000\""]
["Depuis","Ethiopie / Adindan","Clarke 1880 Mod","\"-0165,00;-0011,00;+0206,00;-0,000;-0,000;-0,000;-0,000\""]
["Depuis","Europe / ED50","International","\"-0089,50;-0093,80;-0123,10;-0,000;-0,000;-0,156;+1,200\"",null,null,null,null,null,null,null,null,null,null,null,null,null,null,null,null,null,null,null,null,null,null,null,null,null,null,null,null,null,null,null,null,null,null,null,null,null,null,null,"\"-0006,39;+0003,58;-0005,87;-0,006;+0,045;-0,200;+1,078\"",null,null,null,null,null,null,null,null,null,null,null,null,null,null,null,null,null,null,null,null,null,null,null,null,null,null,null,null,null,null,null,null,null,null,null,null,null,null,null,null,null,null,null,null,null,null,null,null,null,null,null,null,null,null,null,null,null,null,null,null,null,null,null,null,null,null,null,null,null,null,null,null,null,null,null,null,null,null,null,null,null,null,null,null,null,"\"-0089,50;-0093,80;-0127,60;-0,000;-0,000;-0,970;+1,800\"","\"-0083,00;-0110,00;-0118,00;-0,000;-0,000;-0,000;-0,000\"","\"-0089,50;-0093,80;-0127,60;-0,000;-0,000;-0,970;+1,800\"",null,null,null,null,null,null,null,null,null,null,null,null,null,null,null,null,null,null,null,null,null,null,null,"\"-0116,50;+0041,20;-0038,60;-0,000;-0,000;-0,710;+0,973\""]
["Depuis","Europe / ED87","International","\"-0083,11;-0097,38;-0117,23;-0,006;-0,045;+0,044;+0,122\"",null,null,null,null,null,null,null,null,null,null,null,null,null,null,null,null,null,null,null,null,null,null,null,null,null,null,null,null,null,null,null,null,null,null,null,null,null,null,"\"+0006,39;-0003,58;+0005,87;+0,006;-0,045;+0,200;-1,078\"",null,null,null,null,null,null,null,null,null,null,null,null,null,null,null,null,null,null,null,null,null,null,null,null,null,null,null,null,null,null,null,null,null,null,null,null,null,null,null,null,null,null,null,null,null,null,null,null,null,null,null,null,null,null,null,null,null,null,null,null,null,null,null,null,null,null,null,null,null,null,null,null,null,null,null,null,null,null,null,null,null,null,null,null,null,null,null,null,null,null,"\"-0082,98;-0099,72;-0110,71;-0,105;+0,031;+0,080;-0,314\""]
[null,"Finlande / ED50","International","\"-0087,00;-0095,00;-0120,00;-0,000;-0,000;-0,000;-0,000\""]
["Depuis","France / ED50 IGN","International","\"-0084,00;-0097,00;-0117,00;-0,000;-0,000;-0,000;-14,19\""]
["Depuis","France / ED79 France","International","\"-0083,00;-0095,00;-0116,00;-0,000;-0,000;-0,000;-14,19\""]
["Depuis","France / IGN/NTF","Clarke 1880 (IGN)","\"-0168,00;-0060,00;+0320,00;-0,000;-0,000;-0,000;-54,74\""]
["Depuis","France / WGS72 France","WGS72","\"+0000,00;+0012,00;+0006,00;-0,000;-0,000;-0,000;+0,031\""]
["Depuis","Gabon / M'Paraloko","Clarke 1880","\"-0077,90;-0132,90;+0043,70;-0,000;-0,000;-0,000;-0,000\""]
["Depuis","Gizo / Gizo DOS 1968","International","\"+0230,00;-0199,00;-0752,00;-0,000;-0,000;-0,000;-0,000\""]
[null,"Grece / ED50","International","\"-0084,00;-0095,00;-0130,00;-0,000;-0,000;-0,000;-0,000\""]
["Depuis","Groenland / NAD27","Clarke 1866","\"+0011,00;+0114,00;+0195,00;-0,000;-0,000;-0,000;-0,000\""]
["Depuis","Groenland / Qornoq","International","\"+0164,00;+0138,00;-0189,00;-0,000;-0,000;-0,000;-0,000\""]
["Depuis","Guatemala / NAD27","Clarke 1866","\"-0000,00;+0125,00;+0194,00;-0,000;-0,000;-0,000;-0,000\""]
["Depuis","Guyana / Prov. S American 1956","International","\"-0288,00;+0175,00;-0376,00;-0,000;-0,000;-0,000;-0,000\""]
["Depuis","Guyana / S American 1969","S American","\"-0057,00;+0001,00;-0041,00;-0,000;-0,000;-0,000;-0,000\""]
["Depuis","Honduras / NAD27","Clarke 1866","\"-0000,00;+0125,00;+0194,00;-0,000;-0,000;-0,000;-0,000\""]
["Depuis","Hong Kong / Hong Kong 1963","International","\"-0156,00;-0271,00;-0189,00;-0,000;-0,000;-0,000;-0,000\""]
["Depuis","Icelande / Hjorsey 1955","International","\"-0073,00;+0046,00;-0086,00;-0,000;-0,000;-0,000;-0,000\""]
["Depuis","Ile d'Efate et Erromango / Bellevue (IGN)","International","\"-0127,00;-0769,00;+0472,00;-0,000;-0,000;-0,000;-0,000\""]
["Depuis","Ile d'Oahu / ?","Clarke 1866","\"+0056,00;-0268,00;-0182,50;-0,000;-0,000;+0,554;+0,227\"",null,null,null,null,null,null,null,null,null,null,null,null,null,null,null,null,null,null,null,null,null,null,null,null,null,null,null,null,null,null,null,null,null,null,null,null,null,null,null,null,null,null,null,null,null,null,null,null,null,null,null,null,null,null,null,null,null,null,null,null,null,null,null,null,null,null,null,null,null,null,null,null,null,null,null,null,null,null,null,null,null,null,null,null,null,null,null,null,null,null,null,null,null,null,null,null,null,null,null,null,null,null,null,null,null,null,null,null,null,null,null,null,null,null,null,null,null,null,null,null,null,null,null,null,null,null,null,null,"\"+0056,00;-0268,00;-0187,00;-0,000;-0,000;-0,000;-0,000\""]
["Depuis","Ile de Costa Rica / NAD27","Clarke 1866","\"-0000,00;+0125,00;+0194,00;-0,000;-0,000;-0,000;-0,000\""]
["Depuis","Ile de Cuba / NAD27","Clarke 1866","\"-0007,00;+0152,00;+0178,00;-0,000;-0,000;-0,000;-0,000\""]
["Depuis","Ile de Guam / Guam 1963","Clarke 1966","\"+0252,00;-0209,00;-0751,00;-0,000;-0,000;-0,000;-0,000\""]
["Depuis","Ile de Kerguelen / Kerguelen","International","\"+0145,00;-0187,00;+0103,00;-0,000;-0,000;-0,000;-0,000\""]
["Depuis","Ile de l'Ascension / Ascension 1958","International","\"-0207,00;+0107,00;+0052,00;-0,000;-0,000;-0,000;-0,000\""]
["Depuis","Ile de la Barbades / NAD27","Clarke 1866","\"-0007,00;+0152,00;+0178,00;-0,000;-0,000;-0,000;-0,000\""]
["Depuis","Ile de la Jamaique / NAD27","Clarke 1866","\"-0007,00;+0152,00;+0178,00;-0,000;-0,000;-0,000;-0,000\""]
["Depuis","Ile de Madere / SE Base","International","\"-0499,00;-0249,00;+0314,00;-0,000;-0,000;-0,000;-0,000\""]
["Depuis","Ile de Sao Miguel / Sao Braz","International","\"-0203,00;+0141,00;+0053,00;-0,000;-0,000;-0,000;-0,000\""]
[null,"Ile de Sardaigne / ED50","International","\"-0097,00;-0103,00;-0120,00;-0,000;-0,000;-0,000;-0,000\""]
["Depuis","Ile de Sardaigne / Rome 1940","International","\"-0255,00;-0065,00;+0009,00;-0,000;-0,000;-0,000;-0,000\""]
[null,"Ile de Sicile / ED50","International","\"-0097,00;-0088,00;-0135,00;-0,000;-0,000;-0,000;-0,000\""]
["Depuis","Ile de Tern / Asrto B4","International","\"+0114,00;-0116,00;-0333,00;-0,000;-0,000;-0,000;-0,000\""]
["Depuis","Ile Diego Garcia / ISTS 073 Astro 1969","International","\"+0208,00;-0435,00;-0229,00;-0,000;-0,000;-0,000;-0,000\""]
["Depuis","Ile Dominique / NAD27","Clarke 1866","\"-0007,00;+0152,00;+0178,00;-0,000;-0,000;-0,000;-0,000\""]
["Depuis","Ile Georgia / DOS 1968","International","\"+0230,00;-0199,00;-0752,00;-0,000;-0,000;-0,000;-0,000\""]
["Depuis","Ile Grand Cayman / NAD27","Clarke 1866","\"-0007,00;+0152,00;+0178,00;-0,000;-0,000;-0,000;-0,000\""]
["Depuis","Ile Guadalcanal / Gux 1 Astro","International","\"+0252,00;-0209,00;-0751,00;-0,000;-0,000;-0,000;-0,000\""]
["Depuis","Ile Hawaii Hawaii / Old Hawaiian","Clarke 1866","\"+0089,00;-0279,00;-0183,00;-0,000;-0,000;-0,000;-0,000\""]
["Depuis","Ile Hawaii Kauai / Old Hawaiian","Clarke 1866","\"+0045,00;-0290,00;-0172,00;-0,000;-0,000;-0,000;-0,000\"",null,null,null,null,null,null,null,null,null,null,null,null,null,null,null,null,null,null,null,null,null,null,null,null,null,null,null,null,null,null,null,null,null,null,null,null,null,null,null,null,null,null,null,null,null,null,null,null,null,null,null,null,null,null,null,null,null,null,null,null,null,null,null,null,null,null,null,null,null,null,null,null,null,null,null,null,null,null,null,null,null,null,null,null,null,null,null,null,null,null,null,null,null,null,null,null,null,null,null,null,null,null,null,null,null,null,null,null,null,null,null,null,null,null,null,null,null,null,null,null,null,null,null,null,null,null,null,null,"\"+0271,00;-0046,00;-0181,0;-0,000;-0,000;-0,000;-0,000\""]
["Depuis","Ile Hawaii Maui / Old Hawaiian","Clarke 1866","\"+0065,00;-0290,00;-0190,00;-0,000;-0,000;-0,000;-0,000\"",null,null,null,null,null,null,null,null,null,null,null,null,null,null,null,null,null,null,null,null,null,null,null,null,null,null,null,null,null,null,null,null,null,null,null,null,null,null,null,null,null,null,null,null,null,null,null,null,null,null,null,null,null,null,null,null,null,null,null,null,null,null,null,null,null,null,null,null,null,null,null,null,null,null,null,null,null,null,null,null,null,null,null,null,null,null,null,null,null,null,null,null,null,null,null,null,null,null,null,null,null,null,null,null,null,null,null,null,null,null,null,null,null,null,null,null,null,null,null,null,null,null,null,null,null,null,null,null,"\"+0272,00;-0065,00;+0197,00;-0,000;-0,000;-0,000;-0,000\""]
["Depuis","Ile Hawaii Oahu / Old Hawaiian","Clarke 1866","\"+0056,00;-0284,00;-0181,00;-0,000;-0,000;-0,000;-0,000\"",null,null,null,null,null,null,null,null,null,null,null,null,null,null,null,null,null,null,null,null,null,null,null,null,null,null,null,null,null,null,null,null,null,null,null,null,null,null,null,null,null,null,null,null,null,null,null,null,null,null,null,null,null,null,null,null,null,null,null,null,null,null,null,null,null,null,null,null,null,null,null,null,null,null,null,null,null,null,null,null,null,null,null,null,null,null,null,null,null,null,null,null,null,null,null,null,null,null,null,null,null,null,null,null,null,null,null,null,null,null,null,null,null,null,null,null,null,null,null,null,null,null,null,null,null,null,null,null,"\"+0268,00;-0056,00;+0187,00;-0,000;-0,000;-0,000;-0,000\""]
["Depuis","Ile Iwo Jima / Astro Beacon East","International","\"+0145,00;+0075,00;-0272,00;-0,000;-0,000;-0,000;-0,000\""]
["Depuis","Ile Johnson / Johnson Is 1961","International","\"+0191,00;-0077,00;-0204,00;-0,000;-0,000;-0,000;-0,000\""]
["Depuis","Ile Mahe / Ile Mahe 1971","Clarke 1880 Mod","\"+0041,00;-0220,00;-0134,00;-0,000;-0,000;-0,000;-0,000\""]
["Depuis","Ile Marcus / Asrto Stn 1952","International","\"+0124,00;-0234,00;-0025,00;-0,000;-0,000;-0,000;-0,000\""]
["Depuis","Ile Pitcairn / Pitcairn Astro 1967","International","\"+0185,00;+0165,00;+0042,00;-0,000;-0,000;-0,000;-0,000\""]
[null,"Ile Saint Helene / Astro DOS 7","International","\"-0320,00;+0550,00;-0494,00;-0,000;-0,000;-0,000;-0,000\""]
["Depuis","Ile Santa Maria / Sao Braz","International","\"-0203,00;+0141,00;+0053,00;-0,000;-0,000;-0,000;-0,000\""]
["Depuis","Ile Tristan da Cunha / Tristan Astro","International","\"-0632,00;+0438,00;-0609,00;-0,000;-0,000;-0,000;-0,000\""]
["Depuis","Ile Viti Levu / Viti Levu 1916","Clarke 1880 Mod","\"+0051,00;+0391,00;-0036,00;-0,000;-0,000;-0,000;-0,000\""]
["Depuis","Iles Bahamas / Cape Canaveral","Clarke 1866","\"-0002,00;+0150,00;+0181,00;-0,000;-0,000;-0,000;-0,000\""]
["Depuis","Iles Bahamas / NAD27","Clarke 1866","\"-0004,00;+0154,00;+0178,00;-0,000;-0,000;-0,000;-0,000\""]
["Depuis","Iles Caicos / NAD27","Clarke 1866","\"-0007,00;+0152,00;+0178,00;-0,000;-0,000;-0,000;-0,000\""]
["Depuis","Iles Caiman / LC 5 Astro","Clarke 1866","\"+0042,00;+0124,00;+0147,00;-0,000;-0,000;-0,000;-0,000\""]
["Depuis","Iles Canaries / Pico de las Nieves","International","\"-0307,00;-0092,00;+0127,00;-0,000;-0,000;-0,000;-0,000\""]
["Depuis","Iles Chatam / Ile Chatam 1971","International","\"+0175,00;-0038,00;+0113,00;-0,000;-0,000;-0,000;-0,000\""]
["Depuis","Iles Cocos / Australian","RE 1967","\"-0491,00;-0022,00;+0435,00;-0,000;-0,000;-0,000;-0,000\""]
["Depuis","Iles de Mascarenes / Reunion","International","\"+0094,00;-0948,00;-1262,00;-0,000;-0,000;-0,000;-0,000\""]
["Depuis","Iles de Midway / Midway Astro 1961","International","\"+0912,00;-0058,00;+1227,00;-0,000;-0,000;-0,000;-0,000\""]
["Depuis","Iles de Paques / Iles de Paques 1967","International","\"+0211,00;+0147,00;+0111,00;-0,000;-0,000;-0,000;-0,000\""]
["Depuis","Iles des Açores / Observatorio 1966","International","\"-0425,00;-0169,00;+0081,00;-0,000;-0,000;-0,000;-0,000\""]
["Depuis","Iles des Açores / SW Base","International","\"-0104,00;+0167,00;-0038,00;-0,000;-0,000;-0,000;-0,000\""]
["Depuis","Iles des Bermudes / Bermuda 1957","Clarke 1866","\"-0073,00;+0213,00;+0296,00;-0,000;-0,000;-0,000;-0,000\""]
["Depuis","Iles Falklands / Sapper Hill 1943","International","\"-0355,00;+0016,00;+0074,00;-0,000;-0,000;-0,000;-0,000\""]
["Depuis","Iles Maldives / Gandajika Base","International","\"-0133,00;-0321,00;+0050,00;-0,000;-0,000;-0,000;-0,000\""]
["Depuis","Iles Marshall / Wake Eniwetok 1960","Hough","\"+0101,00;+0052,00;-0039,00;-0,000;-0,000;-0,000;-0,000\""]
["Depuis","Iles Phoenix / Canton Astro 1966","International","\"+0298,00;-0304,00;-0375,00;-0,000;-0,000;-0,000;-0,000\""]
["Depuis","Iles Salvages / Marco Astro","International","\"-0289,00;-0124,00;+0060,00;-0,000;-0,000;-0,000;-0,000\""]
["Depuis","Iles Sous le Vent / NAD27","Clarke 1866","\"-0007,00;+0152,00;+0178,00;-0,000;-0,000;-0,000;-0,000\""]
["Depuis","Iles Trinité & Tobago / Naparima (BWI)","International","\"-0002,00;+0374,00;+0172,00;-0,000;-0,000;-0,000;-0,000\""]
["Depuis","Iles Trinité & Tobago / S. American 1969","S. American 1969","\"-0057,00;+0001,00;-0041,00;-0,000;-0,000;-0,000;-0,000\""]
["Depuis","Iles Vierges / Puerto Rico","Clarke 1866","\"+0011,00;+0072,00;-0101,00;-0,000;-0,000;-0,000;-0,000\""]
[null,"Iran / ED50","International","\"-0117,00;-0132,00;-0164,00;-0,000;-0,000;-0,000;-0,000\""]
["Depuis","Irelande / Ireland 1965","Airy Mod","\"+0506,00;-0122,00;+0611,00;-0,000;-0,000;-0,000;-0,000\""]
["Depuis","Japon / Tokyo","Bessel 1841","\"-0128,00;+0481,00;+0664,00;-0,000;-0,000;-0,000;-0,000\""]
["Depuis","Kenya / Cape Arc 1960","Clarke 1880 Mod","\"-0161,00;-0007,00;-0300,00;-0,000;-0,000;-0,000;-0,000\""]
["Depuis","Lesotho / Cape Arc 1950","Clarke 1880 Mod","\"-0125,00;-0108,00;-0295,00;-0,000;-0,000;-0,000;-0,000\""]
["Depuis","Liberia / Liberia 1964","Clarke 1880 Mod","\"-0090,00;+0040,00;+0088,00;-0,000;-0,000;-0,000;-0,000\""]
["Depuis","Malaisie (Est) / Timbalia","Everest 1830","\"-0689,00;+0691,00;-0046,00;-0,000;-0,000;-0,000;-0,000\""]
["Depuis","Malaisie (Ouest) / Kertau 1948","Everest Mod","\"-0011,00;+0851,00;+0005,00;-0,000;-0,000;-0,000;-0,000\""]
["Depuis","Malawi / Cape Arc 1950","Clarke 1880 Mod","\"-0161,00;-0073,00;-0317,00;-0,000;-0,000;-0,000;-0,000\""]
["Depuis","Mali / Adindan","Clarke 1880 Mod","\"-0163,00;-0020,00;+0220,00;-0,000;-0,000;-0,000;-0,000\""]
["Depuis","Maroc / Merchich","Clarke 1880 Mod","\"+0031,00;+0146,00;+0047,00;-0,000;-0,000;-0,000;-0,000\""]
["Depuis","Maui / Maui","Clarke 1866","\"+0065,00;-0272,00;-0192,50;-0,000;-0,000;+0,554;+0,227\"",null,null,null,null,null,null,null,null,null,null,null,null,null,null,null,null,null,null,null,null,null,null,null,null,null,null,null,null,null,null,null,null,null,null,null,null,null,null,null,null,null,null,null,null,null,null,null,null,null,null,null,null,null,null,null,null,null,null,null,null,null,null,null,null,null,null,null,null,null,null,null,null,null,null,null,null,null,null,null,null,null,null,null,null,null,null,null,null,null,null,null,null,null,null,null,null,null,null,null,null,null,null,null,null,null,null,null,null,null,null,null,null,null,null,null,null,null,null,null,null,null,null,null,null,null,null,null,null,"\"+0065,00;-0272,00;-0197,00;-0,000;-0,000;-0,000;-0,000\""]
["Depuis","Mexique / NAD27","Clarke 1866","\"-0012,00;+0130,00;+0190,00;-0,000;-0,000;-0,000;-0,000\""]
["Depuis","Mindanao / Luzon","Clarke 1866","\"-0133,00;-0079,00;-0072,00;-0,000;-0,000;-0,000;-0,000\""]
["Depuis","Monde / DOPPLER","Precise","\"-0000,00;-0000,00;+0004,50;-0,000;-0,000;+0,814;-0,600\"",null,null,null,null,null,null,null,null,null,null,null,null,null,null,null,null,null,null,null,null,null,null,null,null,null,null,null,null,null,null,null,null,null,null,null,null,null,null,null,null,null,null,null,null,null,null,null,null,null,null,null,null,null,null,null,null,null,null,null,null,null,null,null,null,null,null,null,null,null,null,null,null,null,null,null,null,null,null,null,null,null,null,null,null,null,null,null,null,null,null,null,null,null,null,null,null,null,null,null,null,null,null,null,null,null,null,null,null,null,null,null,null,null,null,null,null,null,null,null,null,null,null,null,null,null,null,null,"\"-0000,00;-0000,00;-0000,00;-0,000;-0,000;-0,260;+0,827\"","\"-0000,00;-0000,00;-0000,00;-0,000;-0,000;+0,260;-0,827\"","\"-0000,00;-0000,00;+0004,50;-0,000;-0,000;+0,814;-6,000\""]
["Depuis","Monde / NWL10D","Broadcast","\"-0000,00;-0000,00;+0004,50;-0,000;-0,000;+0,814;-0,602\""]
["Depuis","Monde / NWL9D","Precise","\"-0000,00;-0000,00;+0004,50;-0,000;-0,000;+0,814;-0,600\""]
["Depuis","Monde / WGS72","WGS72","\"-0000,00;-0000,00;+0004,50;-0,000;-0,000;+0,554;+0,227\""]
[null,"Monde / WGS84 SEA","WGS84","\"-0000,00;-0000,00;+0000,00;-0,000;-0,000;+0,000;-0,000\""]
["Depuis","Namibie / Schwarzeck","Bessel 1841 Mod","\"+0616,00;+0097,00;-0251,00;-0,000;-0,000;-0,000;-0,000\""]
["Depuis","Neherlandes / RD","Bessel RD",null,null,null,null,null,null,null,null,null,null,null,null,null,null,null,null,null,null,null,null,null,null,null,null,null,null,null,null,null,null,null,null,null,null,null,null,null,null,null,"\"+0676,52;+0121,57;+0595,27;-0,000;-0,000;-0,000;-0,000\""]
["Depuis","Nepal / Indian","Everst 1830","\"+0289,00;+0734,00;+0257,00;-0,000;-0,000;-0,000;-0,000\""]
["Depuis","Nicaragua / NAD27","Clarke 1866","\"-0000,00;+0125,00;+0194,00;-0,000;-0,000;-0,000;-0,000\""]
["Depuis","Nigeria / Minna","Clarke 1880 Mod","\"-0092,00;-0093,00;+0122,00;-0,000;-0,000;-0,000;-0,000\""]
[null,"Norvège / ED50","International","\"-0087,00;-0095,00;-0120,00;-0,000;-0,000;-0,000;-0,000\""]
["Depuis","Nouvelles Zelandes / GD 1949","International","\"+0084,00;-0022,00;+0209,00;-0,000;-0,000;-0,000;-0,000\""]
["Depuis","Oman / Oman","Clarke 1880 Mod","\"-0346,00;-0001,00;+0224,00;-0,000;-0,000;-0,000;-0,000\""]
["Depuis","Paraguay / Chua Astro","International","\"-0134,00;+0229,00;-0029,00;-0,000;-0,000;-0,000;-0,000\""]
["Depuis","Paraguay / S American 1969","S American 1969","\"-0057,00;+0001,00;-0041,00;-0,000;-0,000;-0,000;-0,000\""]
["Depuis","Perou / Prov S American 1956","International","\"-0288,00;+0175,00;-0376,00;-0,000;-0,000;-0,000;-0,000\""]
["Depuis","Perou / S American 1969","S American 1969","\"-0057,00;+0001,00;-0041,00;-0,000;-0,000;-0,000;-0,000\""]
["Depuis","Phillipines / Luzon 1911","Clarke 1866","\"-0133,00;-0077,00;-0051,00;-0,000;-0,000;-0,000;-0,000\""]
[null,"Portugal / ED50","International","\"-0088,00;-0109,00;-0122,00;-0,000;-0,000;-0,000;-0,000\""]
["Depuis","Puerto Rico / Puerto Rico","Clarke 1866","\"+0011,00;+0072,00;-0101,00;-0,000;-0,000;-0,000;-0,000\""]
["Depuis","Qatar / Nahrwan","Clarke 1880 Mod","\"-0249,17;-0152,09;+0391,46;-0,000;-0,000;-0,000;+0,000\""]
[null,"Qatar / Nahrwan Maersk","Clarke 1880 Mod","\"-0250,20;-0153,09;+0391,70;-0,000;-0,000;-0,000;+0,000\""]
["Depuis","Qatar / Qatar National","International","\"-0128,16;-0282,42;+0021,93;-0,000;-0,000;-0,000;-0,000\""]
["Depuis","Royaume Uni / DOPPLER","Precise",null,null,null,null,null,null,null,null,null,null,null,null,null,null,null,null,null,null,null,null,null,null,null,null,null,null,null,null,null,null,null,null,null,null,null,null,null,null,null,null,null,null,null,null,null,null,null,null,null,null,null,null,null,null,null,null,null,null,null,null,null,null,null,null,null,null,null,null,null,null,null,null,null,null,null,null,null,null,null,null,null,null,null,null,null,null,null,null,null,null,null,null,null,null,null,null,null,null,null,null,null,null,null,null,null,null,null,null,null,null,null,null,null,null,null,null,null,null,null,null,null,null,null,null,null,null,null,null,null,null,null,null,null,null,null,null,null,null,null,null,null,null,null,null,null,null,null,null,null,null,null,"\"-0370,30;+0111,06;-0431,17;-0,000;-0,000;+0,800;-0,400\""]
["Depuis","Royaume Uni / ED50","International","\"-0086,00;-0096,00;-0120,00;-0,000;-0,000;-0,000;-0,000\"",null,null,null,null,null,null,null,null,null,null,null,null,null,null,null,null,null,null,null,null,null,null,null,null,null,null,null,null,null,null,null,null,null,null,null,null,null,null,null,null,null,null,null,null,null,null,null,null,null,null,null,null,null,null,null,null,null,null,null,null,null,null,null,null,null,null,null,null,null,null,null,null,null,null,null,null,null,null,null,null,null,null,null,null,null,null,null,null,null,null,null,null,null,null,null,null,null,null,null,null,null,null,null,null,null,null,null,null,null,null,null,null,null,null,null,null,null,null,null,null,null,null,null,null,null,null,null,null,null,null,null,null,null,null,null,null,null,null,null,null,null,null,null,null,null,null,null,null,null,null,"\"-0459,80;+0017,26;-0558,77;-0,000;-0,000;-0,170;+1,400\""]
["Depuis","Royaume Uni / OS(SN)80","Airy","\"+0364,71;-0109,42;+0429,00;-0,000;-0,000;-0,156;+1,198\"",null,null,null,null,null,null,null,null,null,null,null,null,null,null,null,null,null,null,null,null,null,null,null,null,null,null,null,null,null,null,null,null,null,null,null,null,null,null,null,null,null,null,null,null,null,null,null,null,null,null,null,null,null,null,null,null,null,null,null,null,null,null,null,null,null,null,null,null,null,null,null,null,null,null,null,null,null,null,null,null,null,null,null,null,null,null,null,null,null,null,null,null,null,null,null,null,null,null,null,null,null,null,null,null,null,null,null,null,null,null,null,null,null,null,null,null,null,null,null,null,null,null,null,null,null,null,null,null,null,null,null,null,null,null,null,null,null,null,null,null,null,null,null,null,null,null,null,null,null,"\"+0454,21;-0015,62;+0552,10;-0,000;-0,000;-0,000;-0,000\""]
["Depuis","Russie / Pulkovo","Krassovsky",null,null,null,null,null,null,null,null,null,null,null,null,null,null,null,null,null,null,null,null,null,null,null,null,null,null,null,null,null,null,null,null,null,null,null,null,null,null,null,"\"+0116,00;-0041,20;+0038,60;-0,000;-0,000;+0,710;-0,973\""]
["Depuis","Russie / WGS72","WGS72",null,null,null,null,null,null,null,null,null,null,null,null,null,null,null,null,null,null,null,null,null,null,null,null,null,null,null,null,null,null,null,null,null,null,null,null,null,null,null,null,null,null,null,null,null,null,null,null,null,null,null,null,null,null,null,null,null,null,null,null,null,null,null,null,null,null,null,null,null,null,null,null,null,null,null,null,null,null,null,null,null,null,null,null,null,null,null,null,null,null,null,null,null,null,null,null,null,null,null,null,null,null,null,null,null,null,null,null,null,null,null,null,null,null,null,null,null,null,null,null,null,null,null,null,null,null,null,null,null,null,null,null,null,null,null,null,null,null,null,null,null,null,null,null,null,null,null,null,null,null,null,null,"\"-0027,00;+0135,00;+0089,00;-0,000;-0,000;-0,000;-0,000\""]
["Depuis","Sabah / Timbalai 1948","Everest 1830","\"-0689,00;+0691,00;-0046,00;-0,000;-0,000;-0,000;-0,000\""]
["Depuis","San Salvador / NAD27","Clarke 1866","\"+0001,00;+0140,00;+0165,00;-0,000;-0,000;-0,000;-0,000\""]
["Depuis","Sarawak / Timbalai 1948","Everst 1830","\"-0689,00;+0691,00;-0046,00;-0,000;-0,000;-0,000;-0,000\""]
["Depuis","Senegal / Adindan","Clarke 1880 Mod","\"-0128,00;-0018,00;+0224,00;-0,000;-0,000;-0,000;-0,000\""]
["Depuis","Singapour / Kertau 1948","Everest Mod","\"-0011,00;+0851,00;+0005,00;-0,000;-0,000;-0,000;-0,000\""]
["Depuis","Singapour / Kertau 1948","Everest 1830","\"+0008,21;+0861,39;+0001,31;-0,000;-0,000;+0,814;-0,380\""]
["Depuis","Singapour / South Asia","Fisher Mod","\"+0007,00;-0010,00;-0026,00;-0,000;-0,000;-0,000;-0,000\""]
["Depuis","Somalie / Afgooye","Krassovsky","\"-0043,00;-0163,00;+0045,00;-0,000;-0,000;-0,000;-0,000\""]
["Depuis","Soudan / Adindan","Clarke 1880 Mod","\"-0161,00;-0014,00;+0205,00;-0,000;-0,000;-0,000;-0,000\""]
["Depuis","Sri Lanka / Kandawala","Everest 1830","\"-0097,00;+0787,00;+0086,00;-0,000;-0,000;-0,000;-0,000\""]
["Depuis","Sumatra / Djakarta (Batavia)","Bessel 1841","\"-0377,00;+0681,00;-0050,00;-0,000;-0,000;-0,000;-0,000\""]
["Depuis","Surinam / Zanderij","International","\"-0265,00;+0120,00;-0358,00;-0,000;-0,000;-0,000;-0,000\""]
[null,"Swaziland / Cape Arc 1950","Clarke 1880","\"-0134,00;-0105,00;-0295,00;-0,000;-0,000;-0,000;-0,000\""]
["Depuis","Tanzanie / Cape Arc 1960","Clarke 1880","\"-0158,00;-0012,00;-0299,00;-0,000;-0,000;-0,000;-0,000\""]
["Depuis","Tasmanie / Australian National","RE 1967","\"-0134,00;-0048,00;+0149,00;-0,000;-0,000;-0,000;-0,000\""]
["Depuis","Thailande / Indian","Everest 1830","\"+0214,00;+0836,00;+0303,00;-0,000;-0,000;-0,000;-0,000\""]
["Depuis","Thailande / Moattama","WGS84","\"-0004,69;+0008,50;+0002,89;-0,000;-0,000;-0,000;-0,000\""]
["Depuis","Tunisie / Carthage","Clarke 1880 Mod","\"-0263,00;+0006,00;+0431,00;-0,000;-0,000;-0,000;-0,000\""]
["Depuis","Turquie / NAD27","Clarke 1866","\"-0007,00;+0152,00;+0178,00;-0,000;-0,000;-0,000;-0,000\""]
["Depuis","USA / NAD27 (CONUS)","Clarke 1866","\"-0022,00;+0157,00;+0180,50;-0,000;-0,000;+0,554;+0,227\"",null,null,null,null,null,null,null,null,null,null,null,null,null,null,null,null,null,null,null,null,null,null,null,null,null,null,null,null,null,null,null,null,null,null,null,null,null,null,null,null,null,null,null,null,null,null,null,null,null,null,null,null,null,null,null,null,null,null,null,null,null,null,null,null,null,null,null,null,null,null,null,null,null,null,null,null,null,null,null,null,null,null,null,null,null,null,null,null,null,null,null,null,null,null,null,null,null,null,null,null,null,null,null,null,null,null,null,null,null,null,null,null,null,null,null,null,null,null,null,null,null,null,null,null,null,null,null,null,"\"-0022,00;+0157,00;+0176,00;-0,000;-0,000;-0,000;-0,000\""]
["Depuis","Venezuela / Prov. S. American 1956","International","\"-0288,00;+0175,00;-0376,00;-0,000;-0,000;-0,000;-0,000\""]
["Depuis","Venezuela / S. American 1969","S. American 1969","\"-0057,00;+0001,00;-0041,00;-0,000;-0,000;-0,000;-0,000\""]
["Depuis","Vietnam / Indian","Everest 1830","\"+0289,00;+0734,00;+0257,00;-0,000;-0,000;-0,000;-0,000\""]
["Depuis","Zaire / Cape Arc 1950","Clarke 1880","\"-0169,00;-0019,00;-0278,00;-0,000;-0,000;-0,000;-0,000\""]
["Depuis","Zambie / Cape Arc 1950","Clarke 1880","\"-0147,00;-0074,00;-0283,00;-0,000;-0,000;-0,000;-0,000\""]
["Depuis","Zimbabwe / Cape Arc 1950","Clarke 1880","\"-0142,00;-0096,00;-0293,00;-0,000;-0,000;-0,000;-0,000\""]
["Depuis"," / "]
["Depuis"," / "]
["Depuis"," / "]
["Depuis"," / "]
["Depuis"," / "]
["Depuis"," / "]
["Depuis"," / "]
["Depuis"," / "]
["Depuis"," / "]