{"text_format":"1","workbook":"xlsx","n_sheets":5,"sheets":["Geodesie","Calcul shift geo","Conversion","Spheroides","Table Datum Shifts"],"not_rendered":{"charts":0,"images":0,"macros":1,"external_links":0,"defined_names":2,"comments":0,"pivot_tables":0},"unopened":[{"sheet":"Calcul shift geo","index":1,"reason":"part_missing"}],"bounds":{"document_bytes":16777216,"sheet_cells":100000,"rows_first":2000,"rows_last":500,"rows_between":2000,"halvings":0,"cell_chars":16384,"cell_head_chars":4096},"cells_cut":0,"cells_raw":0,"read":"whole","date_system":"1904"}

{"sheet":"Geodesie","index":0,"n_rows":26,"n_cols":11,"rows_kept":26,"cut":false,"hidden":false,"merged":[]}
["Paramètres de Base des Géodésies Utilisées"]
[]
["Index",null,null,"Système 1",null,null,"Index",null,null,"Système 2"]
["Datum:",1,null,"Région & Datum:",{"$f":"(INDEX('Table Datum Shifts'!B15:B203,B4))","v":"Monde / WGS84"},null,"Datum:",45,null,"Région & Datum:",{"$f":"(INDEX('Table Datum Shifts'!B15:B203,H4))","v":"France / IGN/NTF"}]
["Spheroide:",42,null,"Ellipsoïde:",{"$f":"INDEX(Spheroides!C8:C56,B5)","v":"WGS 84"},null,"Sphéroïde:",12,null,"Ellipsoïde",{"$f":"INDEX(Spheroides!C8:C56,H5)","v":"CLARKE 1880 IGN"}]
[null,null,null,"Gd Axe:",{"$f":"INDEX(Spheroides!D8:D56,B5)","v":6378137},null,null,null,null,"Gd Axe",{"$f":"INDEX(Spheroides!D8:D56,H5)","v":6378249.2000000002}]
[null,null,null,"Pt Axe:",{"$f":"INDEX(Spheroides!E8:E56,B5)","v":6356752.3140000002},null,null,null,null,"Pt Axe",{"$f":"INDEX(Spheroides!E8:E56,H5)","v":6356515}]
[null,null,null,"e2",{"$f":"INDEX(Spheroides!F8:F56,B5)","v":6.6943800667646578E-3},null,null,null,null,"e2",{"$f":"INDEX(Spheroides!F8:F56,H5)","v":6.8034876462998934E-3}]
[null,null,null,"n",{"$f":"INDEX(Spheroides!G8:G56,B5)","v":1.6792204056685965E-3},null,null,null,null,"n",{"$f":"INDEX(Spheroides!G8:G56,H5)","v":0}]
[null,null,null,"1 / f",{"$f":"INDEX(Spheroides!H8:H56,B5)","v":298.25722014342756},null,null,null,null,"1 / f",{"$f":"INDEX(Spheroides!H8:H56,H5)","v":293.46602129362691}]
{"$rows_left_out":17}
{"sheet":"Conversion","index":2,"n_rows":10,"n_cols":20,"rows_kept":10,"cut":false,"hidden":false,"merged":[[6,15,6,18],[2,1,2,3],[2,4,2,9],[2,11,2,13],[2,14,2,19],[8,2,8,4],[8,6,8,8],[8,12,8,14],[8,16,8,18],[3,1,3,3],[3,4,3,9],[3,11,3,13],[3,14,3,19],[5,1,5,9],[6,1,6,4],[6,5,6,8],[6,11,6,14]]}
[]
[]
[null,"Géodésie 1",null,null,{"$f":"Geodesie!E4","v":"Monde / WGS84"},null,null,null,null,null,null,"Géodésie 2",null,null,{"$f":"Geodesie!K4","v":"France / IGN/NTF"}]
[null,"Sphéroïde",null,null,{"$f":"Geodesie!E5","v":"WGS 84"},null,null,null,null,null,null,"Sphéroïde",null,null,{"$f":"Geodesie!K5","v":"CLARKE 1880 IGN"}]
[null,{"$f":"B8+C8/60+D8/3600","v":43.164999999999999},{"$f":"CaGeLon1(B28,F28)","v":{"$error":"#NAME?"}},{"$f":"(ABS(B5)-ABS(B8))*60","v":9.8999999999999488},null,{"$f":"F8+G8/60+H8/3600","v":2.3372291666666669},null,{"$f":"(ABS(C5)-ABS(F8))*60","v":{"$error":"#NAME?"}},null,null,null,{"$f":"geoshiftlat(C10,D10,G10,H10)","v":43.164978764628266},null,{"$f":"(ABS(L5)-ABS(L8))*60","v":9.8987258776959663},null,{"$f":"geoshiftlon(C10,D10,G10,H10)","v":2.3378820495103341},null,{"$f":"(ABS(P5)-ABS(P8))*60","v":20.272922970620044}]
[null,"Coordonnées Géographiques",null,null,null,null,null,null,null,null,null,"Coordonnées Géographiques"]
[null,"Latitude",null,null,null,"Longitude",null,null,null,"Elévation",null,"Latitude",null,null,null,"Longitude",null,null,null,"Elévation"]
[null,43,9,54,{"$f":"IF(B5<0,\"S\",\"N\")","v":"N"},2,20,14.025,{"$f":"IF(F5<0,\"W\",\"E\")","v":"E"},0,null,{"$f":"TRUNC(L5,0)","v":43},{"$f":"TRUNC((ABS(L5)-ABS(L8))*60)","v":9},{"$f":"(N5-M8)*60","v":53.923552661757981},{"$f":"IF(L5<0,\"S\",\"N\")","v":"N"},{"$f":"TRUNC(P5,0)","v":2},{"$f":"TRUNC((ABS(P5)-ABS(P8))*60)","v":20},{"$f":"(R5-Q8)*60","v":16.375378237202654},{"$f":"IF(P5<0,\"W\",\"E\")","v":"E"},{"$f":"elevation2(C10,D10,G10,H10,J8)","v":304.97544554248452}]
[null,null,"Latitude",null,null,null,"Longitude",null,null,null,null,null,"Latitude",null,null,null,"Longitude"]
[null,null,{"$f":"TRUNC(B5,0)","v":43},{"$f":"ABS(B5-TRUNC(B5,0))*60","v":9.8999999999999488},{"$f":"IF(B5<0,\"S\",\"N\")","v":"N"},null,{"$f":"TRUNC(F5,0)","v":2},{"$f":"ABS(F5-F8)*60","v":20.233750000000015},{"$f":"IF(F5<0,\"W\",\"E\")","v":"E"},null,null,null,{"$f":"TRUNC(L5,0)","v":43},{"$f":"ABS(L5-TRUNC(L5,0))*60","v":9.8987258776959663},{"$f":"IF(L5<0,\"S\",\"N\")","v":"N"},null,{"$f":"TRUNC(P5,0)","v":2},{"$f":"ABS(P5-P8)*60","v":20.272922970620044},{"$f":"IF(P5<0,\"W\",\"E\")","v":"E"}]
{"$rows_left_out":1}
{"sheet":"Spheroides","index":3,"n_rows":56,"n_cols":8,"rows_kept":56,"cut":false,"hidden":true,"merged":[]}
["Liste des Ellipsoides Disponibles"]
[]
[]
[]
[]
[]
[null,null,"Nom","Demi Grand","Demi Petit","e2","n","1 / f"]
[null,1,"AIRY",6377563.3959999997,6356256.909,{"$f":"POWER(1/D8*(SQRT((D8*D8)-(E8*E8))),2)","v":6.6705400741490836E-3},1.6732202503250534E-3,{"$f":"1/((D8-E8)/D8)","v":299.32496126649505}]
[null,2,"AIRY MOD",6377340.1890000002,6356034.4479999999,6.6705399807736503E-3,1.6732203054869081E-3,299.32496546352854]
[null,3,"AUSTRALIAN NATIONAL 1967/84",6378160,6356774.7189999996,6.694541915624532E-3,null,298.24999727615801]
{"$rows_left_out":47}
{"sheet":"Table Datum Shifts","index":4,"n_rows":203,"n_cols":186,"rows_kept":203,"cut":false,"hidden":true,"merged":[]}
["Datum System 1",null,"\"-0136,00;-0108,00;-0292,00;-0,000;-0,000;-0,000;-0,000\""]
["Datum System 2",null,"\"-0168,00;-0060,00;+0320,00;-0,000;-0,000;-0,000;-54,74\""]
[null,null,{"$f":"MID(C1,2,8)","v":"-0136,00"},{"$f":"MID(C1,11,8)","v":"-0108,00"},{"$f":"MID(C1,20,8)","v":"-0292,00"},{"$f":"MID(C1,29,6)","v":"-0,000"},{"$f":"MID(C1,36,6)","v":"-0,000"},{"$f":"MID(C1,43,6)","v":"-0,000"},{"$f":"MID(C1,50,6)","v":"-0,000"}]
[null,null,{"$f":"MID(C2,2,8)","v":"-0168,00"},{"$f":"MID(C2,11,8)","v":"-0060,00"},{"$f":"MID(C2,20,8)","v":"+0320,00"},{"$f":"MID(C2,29,6)","v":"-0,000"},{"$f":"MID(C2,36,6)","v":"-0,000"},{"$f":"MID(C2,43,6)","v":"-0,000"},{"$f":"MID(C2,50,6)","v":"-54,74"}]
[null,null,{"$f":"C3-C4","v":32},-48,-612,0,0,0,54.74]
[null,null,{"$f":"ABS(C5)","v":32},48,612,0,0,0,54.74]
[null,null,{"$f":"TEXT(C6,\"0000,00\")","v":"0032,00"},{"$f":"TEXT(D6,\"0000,00\")","v":"0048,00"},{"$f":"TEXT(E6,\"0000,00\")","v":"0612,00"},{"$f":"TEXT(F6,\"0,000\")","v":"0,000"},{"$f":"TEXT(G6,\"0,000\")","v":"0,000"},{"$f":"TEXT(H6,\"0,000\")","v":"0,000"},{"$f":"TEXT(I6,\"0,000\")","v":"54,740"}]
[null,null,{"$f":"IF(C5>0,CONCATENATE(\"+\",C7),CONCATENATE(\"-\",C7))","v":"+0032,00"},"-0048,00","-0612,00","-0,000","-0,000","-0,000","+54,740"]
[null,null,{"$f":"CONCATENATE(\"\"\"\",C8,\";\")","v":"\"+0032,00;"},{"$f":"CONCATENATE(D8,\";\")","v":"-0048,00;"},{"$f":"CONCATENATE(E8,\";\")","v":"-0612,00;"},{"$f":"CONCATENATE(F8,\";\")","v":"-0,000;"},{"$f":"CONCATENATE(G8,\";\")","v":"-0,000;"},{"$f":"CONCATENATE(H8,\";\")","v":"-0,000;"},{"$f":"CONCATENATE(I8,\"\"\"\")","v":"+54,740\""}]
["Datum Calcule",null,{"$f":"CONCATENATE(C9,D9,E9,F9,G9,H9,I9)","v":"\"+0032,00;-0048,00;-0612,00;-0,000;-0,000;-0,000;+54,740\""}]
{"$rows_left_out":193}