{"text_format":"1","workbook":"xlsx","n_sheets":11,"sheets":["Choix","Geodesies","Geographique","UTM","Mercator","Lambert","Cartesiens","Spheroides","Table Datum Shifts","Projections","Parametres Proj"],"not_rendered":{"charts":0,"images":0,"macros":1,"external_links":0,"defined_names":0,"comments":0,"pivot_tables":0},"unopened":[],"bounds":{"document_bytes":16777216,"sheet_cells":100000,"rows_first":2000,"rows_last":500,"rows_between":2000,"halvings":0,"cell_chars":16384,"cell_head_chars":4096},"cells_cut":0,"cells_raw":0,"read":"whole","date_system":"1900"}

{"sheet":"Choix","index":0,"n_rows":34,"n_cols":6,"rows_kept":34,"cut":false,"hidden":false,"merged":[[30,1,30,2],[1,1,1,2],[2,1,2,2],[3,1,3,2],[7,1,7,2],[17,1,17,2],[30,4,30,5],[1,4,1,5],[2,4,2,5],[3,4,3,5],[7,4,7,5],[17,4,17,5]]}
[]
[null,"Géodésie 1",null,null,"Géodésie 2"]
[]
[null,"Sphéroide",null,null,"Sphéroide"]
[null,"Région & Datum",null,null,"Région & Datum"]
[null,"Sphéroide"]
[]
[null,"Paramètres UTM",null,null,"Paramètres UTM"]
[null,"Projection",null,null,"Projection"]
[null,"Méridien central",null,null,"Méridien central"]
[null,"E/W",null,null,"E/W"]
[null,"Latitude d'origine",null,null,"Latitude d'origine"]
[null,"N/S",null,null,"N/S"]
[null,"Applatissement",null,null,"Applatissement"]
[null,"Faux Est",null,null,"Faux Est"]
[null,"Faux Nord",null,null,"Faux Nord"]
[]
[null,"Paramètres Mercator",null,null,"Paramètres Mercator"]
[null,"Méridien D'orignie",null,null,"Méridien D'orignie"]
[null,"E/W",null,null,"E/W"]
[null,"Longitude d'origine",null,null,"Longitude d'origine"]
[null,"E/W",null,null,"E/W"]
[null,"Latitude Standard",null,null,"Latitude Standard"]
[null,"N/S",null,null,"N/S"]
[null,"Latitude d'origine",null,null,"Latitude d'origine"]
[null,"N/S",null,null,"N/S"]
[null,"Ko",null,null,"Ko"]
[null,"Xo",null,null,"Xo"]
[null,"Yo",null,null,"Yo"]
[]
[null,"Paramètres Cônique Conforme",null,null,"Paramètres Cônique Conforme"]
[null,"Projection",null,null,"Projection"]
[null,"Système géodésique",{"$f":"Geodesies!E44","v":"France IGN / NTF"},null,"Système géodésique",{"$f":"Geodesies!N44","v":"France IGN / NTF"}]
[null,"Ellipsoïde",{"$f":"Geodesies!E45","v":"Clarke 1880 IGN"},null,"Ellipsoïde",{"$f":"Geodesies!N45","v":"Clarke 1880 IGN"}]

{"sheet":"Geodesies","index":1,"n_rows":45,"n_cols":16,"rows_kept":45,"cut":false,"hidden":true,"merged":[[2,3,2,4],[10,3,10,4],[34,3,34,4],[21,3,21,4],[2,12,2,13],[10,12,10,13],[34,12,34,13],[21,12,21,13],[2,7,2,8]]}
[]
[]
[null,null,null,"Sphéroide 1",null,null,null,"Datum Shifts de 1 vers 2",null,null,null,null,"Sphéroide 2"]
[null,null,44,"Région & Datum:",{"$f":"(INDEX('Table Datum Shifts'!$B$3:$B$185,C4))","v":"France / IGN/NTF"},null,{"$f":"INDEX('Table Datum Shifts'!$D$3:$D$199,C4)","v":-168},"Dx",{"$f":"G4-J4","v":0},{"$f":"INDEX('Table Datum Shifts'!$D$3:$D$199,L4)","v":-168},null,44,"Région & Datum:",{"$f":"(INDEX('Table Datum Shifts'!$B$3:$B$185,L4))","v":"France / IGN/NTF"}]
[null,null,12,"Sphéroïde:",{"$f":"INDEX(Spheroides!$C$8:$C$56,C5)","v":"CLARKE 1880 IGN"},null,{"$f":"INDEX('Table Datum Shifts'!$E$3:$E$199,C4)","v":-60},"Dy",{"$f":"G5-J5","v":0},{"$f":"INDEX('Table Datum Shifts'!$E$3:$E$199,L4)","v":-60},null,12,"Sphéroïde:",{"$f":"INDEX(Spheroides!$C$8:$C$56,L5)","v":"CLARKE 1880 IGN"}]
[null,null,null,"Gd Axe:",{"$f":"INDEX(Spheroides!$D$8:$D$56,C5)","v":6378249.2000000002},null,{"$f":"INDEX('Table Datum Shifts'!$F$3:$F$199,C4)","v":320},"Dz",0,{"$f":"INDEX('Table Datum Shifts'!$F$3:$F$199,L4)","v":320},null,null,"Gd Axe:",{"$f":"INDEX(Spheroides!$D$8:$D$56,L5)","v":6378249.2000000002}]
[null,null,null,"Pt Axe:",{"$f":"INDEX(Spheroides!$E$8:$E$56,C5)","v":6356515},null,{"$f":"INDEX('Table Datum Shifts'!$G$3:$G$199,C4)","v":0},"Rx",0,{"$f":"INDEX('Table Datum Shifts'!$G$3:$G$199,L4)","v":0},null,null,"Pt Axe:",{"$f":"INDEX(Spheroides!$E$8:$E$56,L5)","v":6356515}]
[null,null,null,"e2",{"$f":"INDEX(Spheroides!$F$8:$F$56,C5)","v":6.8034876462998934E-3},null,{"$f":"INDEX('Table Datum Shifts'!$H$3:$H$199,C4)","v":0},"Ry",0,{"$f":"INDEX('Table Datum Shifts'!$H$3:$H$199,L4)","v":0},null,null,"e2",{"$f":"INDEX(Spheroides!$F$8:$F$56,L5)","v":6.8034876462998934E-3}]
[null,null,null,"1 / f",{"$f":"INDEX(Spheroides!$H$8:$H$56,C5)","v":293.46602129362691},null,{"$f":"INDEX('Table Datum Shifts'!$I$3:$I$199,C4)","v":0},"Rz",0,{"$f":"INDEX('Table Datum Shifts'!$I$3:$I$199,L4)","v":0},null,null,"1 / f",{"$f":"INDEX(Spheroides!$H$8:$H$56,L5)","v":293.46602129362691}]
[null,null,null,null,null,null,{"$f":"INDEX('Table Datum Shifts'!$J$3:$J$199,C4)","v":-54.74},"ppm",0,{"$f":"INDEX('Table Datum Shifts'!$J$3:$J$199,L4)","v":-54.74}]
[null,null,null,"Paramètres UTM",null,null,null,null,null,null,null,null,"Paramètres UTM"]
[null,null,1,"Projection",{"$f":"INDEX(Projections!$C$8:$C$9,C12)","v":"UTM N"},null,null,null,null,null,null,1,"Projection",{"$f":"INDEX(Projections!$C$8:$C$9,L12)","v":"UTM N"}]
[null,null,1,"Merid. Ctrl.",{"$f":"INDEX('Parametres Proj'!A3:A46,C13)","v":3},null,null,null,null,null,null,1,"Merid. Ctrl.",{"$f":"INDEX('Parametres Proj'!A3:A46,L13)","v":3}]
[null,null,2,"E/W",{"$f":"INDEX(Projections!$F$8:$F$9,C14)","v":"W"},null,null,null,null,null,null,1,"E/W",{"$f":"INDEX(Projections!$F$8:$F$9,L14)","v":"E"}]
[null,null,null,"Zone",{"$f":"IF(C14=1,C13+30,31-C13)","v":30},null,null,null,null,null,null,null,"Zone",{"$f":"IF(L14=1,L13+30,31-L13)","v":31}]
[null,null,1,"Lat. Or.",{"$f":"INDEX('Parametres Proj'!$F$3:$F$91,C16)","v":0},null,null,null,null,null,null,1,"Lat. Or.",{"$f":"INDEX('Parametres Proj'!$F$3:$F$91,L16)","v":0}]
[null,null,1,"N/S",{"$f":"IF(C17=1,\"N\",\"S\")","v":"N"},null,null,null,null,null,null,1,"N/S",{"$f":"IF(L17=1,\"N\",\"S\")","v":"N"}]
[null,null,1,"Aplat.",{"$f":"INDEX('Parametres Proj'!$E$3:$E$48,C18)","v":0.99903839999999999},null,null,null,null,null,null,1,"Aplat.",{"$f":"INDEX('Parametres Proj'!$E$3:$E$48,L18)","v":0.99903839999999999}]
[null,null,5,"Faux E",{"$f":"INDEX('Parametres Proj'!$C$3:$C$49,C19)","v":500000},null,null,null,null,null,null,5,"Faux E",{"$f":"INDEX('Parametres Proj'!$C$3:$C$49,L19)","v":500000}]
[null,null,2,"Faux N",{"$f":"INDEX('Parametres Proj'!$D$3:$D$48,C20)","v":0},null,null,null,null,null,null,2,"Faux N",{"$f":"INDEX('Parametres Proj'!$D$3:$D$48,L20)","v":0}]
[]
[null,null,null,"Paramètres Mercator",null,null,null,null,null,null,null,null,"Paramètres Mercator"]
[null,null,4,"Meridien d'Origine",{"$f":"INDEX('Parametres Proj'!$F$3:$F$181,C23)","v":3},null,null,null,null,null,null,8,"Meridien d'Origine",{"$f":"INDEX('Parametres Proj'!$F$3:$F$181,L23)","v":9}]
[null,null,1,"E/W",{"$f":"INDEX(Projections!F8:F9,C24)","v":"E"},null,null,null,null,null,null,1,"E/W",{"$f":"INDEX(Projections!F8:F9,L24)","v":"E"}]
[null,null,4,"Longitude d'Origine",{"$f":"INDEX('Parametres Proj'!F3:F181,C25)","v":3},null,null,null,null,null,null,8,"Longitude d'Origine",{"$f":"INDEX('Parametres Proj'!F3:F181,L25)","v":9}]
[null,null,1,"E/W",{"$f":"INDEX(Projections!$F$8:$F$9,Geodesies!C26)","v":"E"},null,null,null,null,null,null,1,"E/W",{"$f":"INDEX(Projections!$F$8:$F$9,L26)","v":"E"}]
[null,null,1,"Latitude Standard",{"$f":"INDEX('Parametres Proj'!$F$3:$F$91,C27)","v":0},null,null,null,null,null,null,1,"Latitude Standard",{"$f":"INDEX('Parametres Proj'!$F$3:$F$91,L27)","v":0}]
[null,null,1,"N/S",{"$f":"INDEX(Projections!H8:H9,C28)","v":"N"},null,null,null,null,null,null,1,"N/S",{"$f":"INDEX(Projections!H8:H9,L28)","v":"N"}]
[null,null,1,"Latitude d'Origine",{"$f":"INDEX('Parametres Proj'!$F$3:$F$91,C29)","v":0},null,-7.081402392022929E-10,null,null,null,null,1,"Latitude d'Origine",{"$f":"INDEX('Parametres Proj'!$F$3:$F$91,L29)","v":0},null,-7.081402392022929E-10]
[null,null,1,"N/S",{"$f":"INDEX(Projections!H8:H9,C30)","v":"N"},null,null,null,null,null,null,1,"N/S",{"$f":"INDEX(Projections!H8:H9,L30)","v":"N"}]
[null,null,9,"Ko",{"$f":"INDEX('Parametres Proj'!E3:E13,C31)","v":1},null,null,null,null,null,null,9,"Ko",{"$f":"INDEX('Parametres Proj'!E3:E13,L31)","v":1}]
[null,null,1,"Xo",{"$f":"INDEX('Parametres Proj'!C3:C14,C32)","v":0},null,null,null,null,null,null,1,"Xo",{"$f":"INDEX('Parametres Proj'!C3:C14,L32)","v":0}]
[null,null,2,"Yo",{"$f":"INDEX('Parametres Proj'!D3:D20,C33)","v":0},null,{"$f":"G29+E33","v":-7.081402392022929E-10},null,null,null,null,2,"Yo",{"$f":"INDEX('Parametres Proj'!D3:D20,L33)","v":0},null,{"$f":"P29+N33","v":-7.081402392022929E-10}]
[]
[null,null,null,"Paramètres Cônique Conforme",null,null,null,null,null,null,null,null,"Paramètres Cônique Conforme"]
[null,null,15,"Projection",{"$f":"INDEX(Projections!C24:C42,Geodesies!C36)","v":"Lambert IV"},null,null,null,null,null,null,19,"Projection",{"$f":"INDEX(Projections!C24:C42,Geodesies!L36)","v":"Lambert 4 Carto"}]
[null,null,null,"Merid. Ctrl.",{"$f":"INDEX(Projections!I24:I42,Geodesies!C36)","v":2.3372291700000001},null,{"$f":"E36","v":"Lambert IV"},null,null,null,null,2,"Merid. Ctrl.",{"$f":"INDEX(Projections!I24:I42,Geodesies!L36)","v":2.3372291700000001}]
[null,null,1,"E/W",{"$f":"INDEX(Projections!$F$8:$F$9,C38)","v":"E"},null,null,null,null,null,null,1,"E/W",{"$f":"INDEX(Projections!$F$8:$F$9,L38)","v":"E"}]
[null,null,null,"Lat. Or.",{"$f":"INDEX(Projections!J24:J42,Geodesies!C36)","v":42.164999999999999},null,null,null,null,null,null,3,"Lat. Or.",{"$f":"INDEX(Projections!J24:J42,Geodesies!L36)","v":42.164999999999999}]
[null,null,1,"N/S",{"$f":"INDEX(Projections!H8:H9,C40)","v":"N"},null,null,null,null,null,null,1,"N/S",{"$f":"INDEX(Projections!H8:H9,L40)","v":"N"}]
[null,null,null,"Aplat.",{"$f":"INDEX(Projections!K24:K42,Geodesies!C36)","v":0.99987742000000002},null,null,null,null,null,null,3,"Aplat.",{"$f":"INDEX(Projections!K24:K42,Geodesies!L36)","v":0.99994470999999996}]
[null,null,null,"Faux E",{"$f":"INDEX(Projections!G24:G42,Geodesies!C36)","v":234.358},null,null,null,null,null,null,6,"Faux E",{"$f":"INDEX(Projections!G24:G42,Geodesies!L36)","v":234.358}]
[null,null,null,"Faux N",{"$f":"INDEX(Projections!H24:H42,Geodesies!C36)","v":185861.36900000001},null,null,null,null,null,null,8,"Faux N",{"$f":"INDEX(Projections!H24:H42,Geodesies!L36)","v":4185861.3689999999}]
[null,null,null,"Système géodésique",{"$f":"INDEX(Projections!E24:E42,Geodesies!C36)","v":"France IGN / NTF"},null,null,null,null,null,null,null,"Système géodésique",{"$f":"INDEX(Projections!E24:E42,Geodesies!L36)","v":"France IGN / NTF"}]
[null,null,null,"Ellipsoïde",{"$f":"INDEX(Projections!F24:F42,Geodesies!C36)","v":"Clarke 1880 IGN"},null,null,null,null,null,null,null,"Ellipsoïde",{"$f":"INDEX(Projections!F24:F42,Geodesies!L36)","v":"Clarke 1880 IGN"}]

{"sheet":"Geographique","index":2,"n_rows":28,"n_cols":20,"rows_kept":28,"cut":false,"hidden":false,"merged":[[3,1,3,3],[3,4,3,9],[3,11,3,13],[3,14,3,19],[0,0,0,20],[2,1,2,3],[2,4,2,9],[2,11,2,13],[2,14,2,19],[5,1,5,9],[5,11,5,19],[6,1,6,4],[6,5,6,8],[6,11,6,14],[6,15,6,18],[11,1,11,8],[11,11,11,18],[12,1,12,4],[12,5,12,8],[12,11,12,14],[12,15,12,18],[13,1,13,4],[13,5,13,8],[13,11,13,14],[13,15,13,18],[14,1,14,4],[14,5,14,8],[14,11,14,14],[14,15,14,18],[15,5,15,8],[15,15,15,18],[17,1,17,8],[17,11,17,18],[18,1,18,4],[18,5,18,8],[18,11,18,14],[18,15,18,18],[19,1,19,4],[19,5,19,8],[19,11,19,14],[19,15,19,18],[21,1,21,8],[21,11,21,18],[22,11,22,14],[22,15,22,18],[23,1,23,4],[23,5,23,8],[23,11,23,14],[23,15,23,18],[8,2,8,4],[8,6,8,8],[8,12,8,14],[8,16,8,18],[27,1,27,4],[27,5,27,8],[27,11,27,14],[27,15,27,18],[25,1,25,9],[25,11,25,19],[26,1,26,4],[26,5,26,8],[26,11,26,14],[26,15,26,18],[22,1,22,4],[22,5,22,8]]}
["Conversion de geographiques"]
[]
[null,"Géodésie 1",null,null,{"$f":"Geodesies!E4","v":"France / IGN/NTF"},null,null,null,null,null,null,"Géodésie 2",null,null,{"$f":"Geodesies!N4","v":"France / IGN/NTF"}]
[null,"Sphéroïde",null,null,{"$f":"Geodesies!E5","v":"CLARKE 1880 IGN"},null,null,null,null,null,null,"Sphéroïde",null,null,{"$f":"Geodesies!N5","v":"CLARKE 1880 IGN"}]
[null,null,null,null,null,null,null,null,null,null,null,{"$f":"CaGeLat2(L28,P28,T28)","v":43.164999999999999},{"$f":"CaGeLon2(L28,P28)","v":2.3372291666666674},{"$f":"(ABS(L5)-ABS(L8))*60","v":9.8999999999999488},null,null,null,{"$f":"(ABS(M5)-ABS(P8))*60","v":20.233750000000043}]
[null,{"$f":"Geodesies!E4","v":"France / IGN/NTF"},null,null,null,null,null,null,null,null,null,{"$f":"Geodesies!N4","v":"France / IGN/NTF"}]
[null,"Latitude",null,null,null,"Longitude",null,null,null,"Elévation",null,"Latitude",null,null,null,"Longitude",null,null,null,"Elévation"]
[null,43,9,54,{"$f":"IF(B8+C8/60+D8/3600>0,\"N\",\"S\")","v":"N"},2,20,14.025,{"$f":"IF(F8+G8/60+H8/3600>0,\"E\",\"W\")","v":"E"},300,null,{"$f":"TRUNC(L5,0)","v":43},{"$f":"TRUNC((ABS(L5)-ABS(L8))*60)","v":9},{"$f":"(N5-M8)*60","v":53.99999999999693},{"$f":"IF(L5<0,\"S\",\"N\")","v":"N"},{"$f":"TRUNC(M5,0)","v":2},{"$f":"TRUNC((ABS(M5)-ABS(P8))*60)","v":20},{"$f":"(R5-Q8)*60","v":14.025000000002592},{"$f":"IF(M5<0,\"W\",\"E\")","v":"E"},{"$f":"CaGeEle2(L28,P28,T28)","v":300}]
[null,{"$f":"B7","v":"Latitude"},"Latitude",null,null,{"$f":"F7","v":"Longitude"},"Longitude",null,null,null,null,{"$f":"L7","v":"Latitude"},"Latitude",null,null,{"$f":"P7","v":"Longitude"},"Longitude"]
[null,{"$f":"B8","v":43},{"$f":"B8","v":43},{"$f":"C8+D8/60","v":9.9},{"$f":"E8","v":"N"},{"$f":"F8","v":2},{"$f":"F8","v":2},{"$f":"G8+H8/60","v":20.233750000000001},{"$f":"I8","v":"E"},null,null,{"$f":"L8","v":43},{"$f":"TRUNC(L5,0)","v":43},{"$f":"ABS(L5-TRUNC(L5,0))*60","v":9.8999999999999488},{"$f":"IF(L5<0,\"S\",\"N\")","v":"N"},{"$f":"P8","v":2},{"$f":"TRUNC(M5,0)","v":2},{"$f":"ABS(M5-P8)*60","v":20.233750000000043},{"$f":"IF(M5<0,\"W\",\"E\")","v":"E"}]
[null,{"$f":"B8","v":43},{"$f":"C8+D8/60","v":9.9},null,null,{"$f":"F8","v":2},{"$f":"G8+H8/60","v":20.233750000000001},null,null,null,null,{"$f":"L8","v":43},{"$f":"M8+N8/60","v":9.8999999999999488},null,null,{"$f":"P8","v":2},{"$f":"Q8+R8/60","v":20.233750000000043}]
[null,{"$f":"Geodesies!E12&\" Zone \"&Geodesies!E15","v":"UTM N Zone 30"},null,null,null,null,null,null,null,null,null,{"$f":"Geodesies!N12&\" Zone \"&Geodesies!N15","v":"UTM N Zone 31"}]
[null,"Easting",null,null,null,"Northing",null,null,null,null,null,"Easting",null,null,null,"Northing"]
[null,{"$f":"GeUtX1(B11,C11,F11,G11)","v":933678.43830715655},null,null,null,{"$f":"GeUtY1(B11,C11,F11,G11)","v":4789983.7449064963},null,null,null,null,null,{"$f":"GeUtX2(L11,M11,P11,Q11)","v":446151.28139902599},null,null,null,{"$f":"GeUtY2(L11,M11,P11,Q11)","v":4776357.8135232124}]
[null,"Convergeance",null,null,null,"Fact. d'Echelle",null,null,null,null,null,"Convergeance",null,null,null,"Fact. d'Echelle"]
[null,{"$f":"TRUNC(B17,0)","v":3},{"$f":"TRUNC((ABS(B17)-ABS(B16))*60)","v":39},{"$f":"(D17-C16)*60","v":24.816547137219516},{"$f":"IF(B17<0,\"W\",\"E\")","v":"E"},{"$f":"FactEchelle1(B14,F14)","v":1.0013540481170558},null,null,null,null,null,{"$f":"TRUNC(L17,0)","v":0},{"$f":"TRUNC((ABS(L17)-ABS(L16))*60)","v":27},{"$f":"(N17-M16)*60","v":12.288654394431262},{"$f":"IF(L17<0,\"W\",\"E\")","v":"W"},{"$f":"FactEchelle2(L14,P14)","v":0.99907408887379612}]
[null,{"$f":"convergence1(B14,F14)","v":3.6568934853158943},null,{"$f":"(ABS(B17)-ABS(B16))*60","v":39.413609118953659},null,null,null,null,null,null,null,{"$f":"convergence2(L14,P14)","v":-0.45341351510956424},null,{"$f":"(ABS(L17)-ABS(L16))*60","v":27.204810906573854}]
[null,{"$f":"\"Mercator \"&Geodesies!E23&Geodesies!E24&\" \"&Geodesies!E27&Geodesies!E28","v":"Mercator 3E 0N"},null,null,null,null,null,null,null,null,null,{"$f":"\"Mercator \"&Geodesies!N23&Geodesies!N24&\" \"&Geodesies!N27&Geodesies!N28","v":"Mercator 9E 0N"}]
[null,"Easting",null,null,null,"Northing",null,null,null,null,null,"Easting",null,null,null,"Northing"]
[null,{"$f":"GeMeX1(F11,G11)","v":260192.84403237063},null,null,null,{"$f":"GeMeY1(B11,C11)","v":5307682.2886358034},null,null,null,null,null,{"$f":"GeMeX2(P11,Q11)","v":260192.84403237066},null,null,null,{"$f":"GeMeY2(L11,M11)","v":5307682.2886358034}]
[]
[null,{"$f":"Geodesies!E36","v":"Lambert IV"},null,null,null,null,null,null,null,null,null,{"$f":"Geodesies!N36","v":"Lambert 4 Carto"}]
[null,"X",null,null,null,"Y",null,null,null,null,null,"X",null,null,null,"Y"]
[null,{"$f":"GeLaX1(B11,C11,F11,G11)","v":234.35772890538578},null,null,null,{"$f":"GeLaY1(B11,C11,F11,G11)","v":296937.73622037936},null,null,null,null,null,{"$f":"GeLaX2(L11,M11,P11,Q11)","v":234.35772888717392},null,null,null,{"$f":"GeLaY2(L11,M11,P11,Q11)","v":4296945.2114654453}]
[]
[null,"Cartésiens",null,null,null,null,null,null,null,null,null,"Cartésiens"]
[null,"X",null,null,null,"Y",null,null,null,"Z",null,"X",null,null,null,"Y",null,null,null,"Z"]
[null,{"$f":"GeCaX(B11,C11,F11,G11,J8)","v":4655976.2333961427},null,null,null,{"$f":"GeCaY(B11,C11,F11,G11,J8)","v":190033.60368746312},null,null,null,{"$f":"GeCaZ(B11,C11,F11,G11,J8)","v":4340805.8048159722},null,{"$f":"CaCaX(B28,F28,J28)","v":4655976.2333961427},null,null,null,{"$f":"CaCaY(B28,F28,J28)","v":190033.60368746312},null,null,null,{"$f":"CaCaZ(B28,F28,J28)","v":4340805.8048159722}]

{"sheet":"UTM","index":3,"n_rows":28,"n_cols":20,"rows_kept":28,"cut":false,"hidden":false,"merged":[[3,1,3,3],[3,4,3,9],[3,11,3,13],[3,14,3,19],[0,0,0,20],[2,1,2,3],[2,4,2,9],[2,11,2,13],[2,14,2,19],[5,1,5,9],[5,11,5,19],[6,1,6,3],[6,4,6,8],[6,11,6,14],[6,15,6,18],[13,1,13,4],[13,5,13,8],[13,11,13,14],[13,15,13,18],[14,1,14,4],[14,5,14,8],[14,11,14,14],[14,15,14,18],[11,1,11,8],[11,11,11,18],[12,1,12,4],[12,5,12,8],[12,11,12,14],[12,15,12,18],[18,1,18,4],[18,5,18,8],[18,11,18,14],[18,15,18,18],[15,5,15,8],[15,15,15,18],[17,1,17,8],[17,11,17,18],[21,1,21,8],[19,1,19,4],[19,5,19,8],[19,11,19,14],[19,15,19,18],[23,11,23,14],[23,15,23,18],[22,1,22,4],[22,5,22,8],[22,11,22,14],[22,15,22,18],[8,16,8,18],[8,2,8,4],[8,6,8,8],[8,12,8,14],[27,1,27,4],[27,5,27,8],[27,11,27,14],[27,15,27,18],[25,1,25,9],[25,11,25,19],[26,1,26,4],[26,5,26,8],[26,11,26,14],[26,15,26,18],[23,1,23,4],[23,5,23,8]]}
["Conversion d'UTM"]
[]
[null,"Géodésie 1",null,null,{"$f":"Geodesies!E4","v":"France / IGN/NTF"},null,null,null,null,null,null,"Géodésie 2",null,null,{"$f":"Geodesies!N4","v":"France / IGN/NTF"}]
[null,"Sphéroïde",null,null,{"$f":"Geodesies!E5","v":"CLARKE 1880 IGN"},null,null,null,null,null,null,"Sphéroïde",null,null,{"$f":"Geodesies!N5","v":"CLARKE 1880 IGN"}]
[null,{"$f":"UtGeLat(B14,F14)","v":45.934136203863694},{"$f":"UtGeLon(B14,F14)","v":-2.9996773533086212},{"$f":"(ABS(B5)-ABS(B8))*60","v":56.048172231821667},null,null,null,{"$f":"(ABS(C5)-ABS(F8))*60","v":59.980641198517269},null,null,null,{"$f":"CaGeLat2(L28,P28,T28)","v":45.93413620386368},{"$f":"CaGeLon2(L28,P28)","v":-2.9996773533086203},{"$f":"(ABS(L5)-ABS(L8))*60","v":56.048172231820814},null,null,null,{"$f":"(ABS(M5)-ABS(P8))*60","v":59.980641198517219}]
[null,"Coordonnées Géographiques",null,null,null,null,null,null,null,null,null,"Coordonnées Géographiques"]
[null,"Latitude",null,null,"Longitude",null,null,null,null,"Elévation",null,"Latitude",null,null,null,"Longitude",null,null,null,"Elévation"]
[null,{"$f":"TRUNC(B5,0)","v":45},{"$f":"TRUNC((ABS(B5)-ABS(B8))*60)","v":56},{"$f":"(D5-C8)*60","v":2.8903339093000113},{"$f":"IF(B5<0,\"S\",\"N\")","v":"N"},{"$f":"TRUNC(C5,0)","v":-2},{"$f":"TRUNC((ABS(C5)-ABS(F8))*60)","v":59},{"$f":"(H5-G8)*60","v":58.838471911036123},{"$f":"IF(C5<0,\"W\",\"E\")","v":"W"},0,null,{"$f":"TRUNC(L5,0)","v":45},{"$f":"TRUNC((ABS(L5)-ABS(L8))*60)","v":56},{"$f":"(N5-M8)*60","v":2.8903339092488523},{"$f":"IF(L5<0,\"S\",\"N\")","v":"N"},{"$f":"TRUNC(M5,0)","v":-2},{"$f":"TRUNC((ABS(M5)-ABS(P8))*60)","v":59},{"$f":"(R5-Q8)*60","v":58.838471911033139},{"$f":"IF(M5<0,\"W\",\"E\")","v":"W"},{"$f":"CaGeEle2(L28,P28,T28)","v":9.3132257461547852E-10}]
[null,{"$f":"B7","v":"Latitude"},"Latitude",null,null,{"$f":"F7","v":0},"Longitude",null,null,null,null,{"$f":"L7","v":"Latitude"},"Latitude",null,null,{"$f":"P7","v":"Longitude"},"Longitude"]
[null,{"$f":"B8","v":45},{"$f":"TRUNC(B5,0)","v":45},{"$f":"ABS(B5-TRUNC(B5,0))*60","v":56.048172231821667},{"$f":"IF(B5<0,\"S\",\"N\")","v":"N"},{"$f":"F8","v":-2},{"$f":"TRUNC(C5,0)","v":-2},{"$f":"ABS(C5-F8)*60","v":59.980641198517269},{"$f":"IF(C5<0,\"W\",\"E\")","v":"W"},null,null,{"$f":"L8","v":45},{"$f":"TRUNC(L5,0)","v":45},{"$f":"ABS(L5-TRUNC(L5,0))*60","v":56.048172231820814},{"$f":"IF(L5<0,\"S\",\"N\")","v":"N"},{"$f":"P8","v":-2},{"$f":"TRUNC(M5,0)","v":-2},{"$f":"ABS(M5-P8)*60","v":59.980641198517219},{"$f":"IF(M5<0,\"W\",\"E\")","v":"W"}]
[]
[null,{"$f":"Geodesies!E12&\" Zone \"&Geodesies!E15","v":"UTM N Zone 30"},null,null,null,null,null,null,null,null,null,{"$f":"Geodesies!N12&\" Zone \"&Geodesies!N15","v":"UTM N Zone 31"}]
[null,"Easting",null,null,null,"Northing",null,null,null,null,null,"Easting",null,null,null,"Northing"]
[null,500025,null,null,null,5083560,null,null,null,null,null,{"$f":"GeUtX2(L10,M10,P10,Q10)","v":108720.8433973708},null,null,null,{"$f":"GeUtY2(L10,M10,P10,Q10)","v":5075439.9512906}]
[null,"Convergeance",null,null,null,"Fact. d'Echelle",null,null,null,null,null,"Convergeance",null,null,null,"Fact. d'Echelle"]
[null,{"$f":"TRUNC(B17,0)","v":0},{"$f":"TRUNC((ABS(B17)-ABS(B16))*60)","v":0},{"$f":"(D17-C16)*60","v":0.83460530784370013},{"$f":"IF(B17<0,\"W\",\"E\")","v":"E"},{"$f":"FactEchelle1(B14,F14)","v":0.99903840000768729},null,null,null,null,null,{"$f":"TRUNC(L17,0)","v":-3},{"$f":"TRUNC((ABS(L17)-ABS(L16))*60)","v":36},{"$f":"(N17-M16)*60","v":35.823589154028355},{"$f":"IF(L17<0,\"W\",\"E\")","v":"W"},{"$f":"FactEchelle2(L14,P14)","v":1.0009221031822868}]
[null,{"$f":"convergence1(B14,F14)","v":2.3183480773436116E-4},null,{"$f":"(ABS(B17)-ABS(B16))*60","v":1.3910088464061669E-2},null,null,null,null,null,null,null,{"$f":"convergence2(L14,P14)","v":-3.6099509969872301},null,{"$f":"(ABS(L17)-ABS(L16))*60","v":36.597059819233806}]
[null,{"$f":"\"Mercator \"&Geodesies!E23&Geodesies!E24&\" \"&Geodesies!E27&Geodesies!E28","v":"Mercator 3E 0N"},null,null,null,null,null,null,null,null,null,{"$f":"\"Mercator \"&Geodesies!N23&Geodesies!N24&\" \"&Geodesies!N27&Geodesies!N28","v":"Mercator 9E 0N"}]
[null,"Easting",null,null,null,"Northing",null,null,null,null,null,"Easting",null,null,null,"Northing"]
[null,{"$f":"GeMeX1(F10,G10)","v":-226361.53545026932},null,null,null,{"$f":"GeMeY1(B10,C10)","v":5709557.7696537143},null,null,null,null,null,{"$f":"GeMeX2(P10,Q10)","v":-226361.53545026932},null,null,null,{"$f":"GeMeY2(L10,M10)","v":5709557.7696537143}]
[]
[null,{"$f":"Geodesies!E36","v":"Lambert IV"},null,null,null,null,null,null,null,null,null,{"$f":"Geodesies!N36","v":"Lambert 4 Carto"}]
[null,"X",null,null,null,"Y",null,null,null,null,null,"X",null,null,null,"Y"]
[null,{"$f":"GeLaX1(B10,C10,F10,G10)","v":-340347.89252991806},null,null,null,{"$f":"GeLaY1(B10,C10,F10,G10)","v":593126.46888548788},null,null,null,null,null,{"$f":"GeLaX2(L10,M10,P10,Q10)","v":-340370.81311916199},null,null,null,{"$f":"GeLaY2(L10,M10,P10,Q10)","v":4593153.8771137604}]
[]
[null,"Cartésiens",null,null,null,null,null,null,null,null,null,"Cartésiens"]
[null,"X",null,null,null,"Y",null,null,null,"Z",null,"X",null,null,null,"Y",null,null,null,"Z"]
[null,{"$f":"GeCaX(C10,D10,G10,H10,J8)","v":4437698.3511233414},null,null,null,{"$f":"GeCaY(C10,D10,G10,H10,J8)","v":-232544.85730557606},null,null,null,{"$f":"GeCaZ(C10,D10,G10,H10,J8)","v":4559867.2467534496},null,{"$f":"CaCaX(B28,F28,J28)","v":4437698.3511233414},null,null,null,{"$f":"CaCaY(B28,F28,J28)","v":-232544.85730557606},null,null,null,{"$f":"CaCaZ(B28,F28,J28)","v":4559867.2467534496}]

{"sheet":"Mercator","index":4,"n_rows":28,"n_cols":20,"rows_kept":28,"cut":false,"hidden":false,"merged":[[3,1,3,3],[3,4,3,9],[3,11,3,13],[3,14,3,19],[0,0,0,20],[2,1,2,3],[2,4,2,9],[2,11,2,13],[2,14,2,19],[5,1,5,9],[5,11,5,19],[6,1,6,4],[6,5,6,8],[6,11,6,14],[6,15,6,18],[11,1,11,8],[11,11,11,18],[12,1,12,4],[12,5,12,8],[12,11,12,14],[12,15,12,18],[13,1,13,4],[13,5,13,8],[13,11,13,14],[13,15,13,18],[14,1,14,4],[14,5,14,8],[14,11,14,14],[14,15,14,18],[15,5,15,8],[15,15,15,18],[17,1,17,8],[17,11,17,18],[18,1,18,4],[18,5,18,8],[18,11,18,14],[18,15,18,18],[19,1,19,4],[19,5,19,8],[19,11,19,14],[19,15,19,18],[21,1,21,8],[21,11,21,18],[22,11,22,14],[22,15,22,18],[23,1,23,4],[23,5,23,8],[23,11,23,14],[23,15,23,18],[8,2,8,4],[8,6,8,8],[8,12,8,14],[8,16,8,18],[27,1,27,4],[27,5,27,8],[27,11,27,14],[27,15,27,18],[25,1,25,9],[25,11,25,19],[26,1,26,4],[26,5,26,8],[26,11,26,14],[26,15,26,18],[22,1,22,4],[22,5,22,8]]}
["Conversion de Mercators"]
[]
[null,"Géodésie 1",null,null,{"$f":"Geodesies!E4","v":"France / IGN/NTF"},null,null,null,null,null,null,"Géodésie 2",null,null,{"$f":"Geodesies!N4","v":"France / IGN/NTF"}]
[null,"Sphéroïde",null,null,{"$f":"Geodesies!E5","v":"CLARKE 1880 IGN"},null,null,null,null,null,null,"Sphéroïde",null,null,{"$f":"Geodesies!N5","v":"CLARKE 1880 IGN"}]
[null,{"$f":"MeGeLat(F20)","v":41.108073297857594},{"$f":"MeGeLon(B20)","v":2.6948041273293728},{"$f":"(ABS(B5)-ABS(B8))*60","v":6.4843978714556272},null,null,null,{"$f":"(ABS(C5)-ABS(F8))*60","v":41.688247639762366},null,null,null,{"$f":"CaGeLat2(L28,P28,T28)","v":41.108073297857594},{"$f":"CaGeLon2(L28,P28)","v":2.6948041273293728},{"$f":"(ABS(L5)-ABS(L8))*60","v":6.4843978714556272},null,null,null,{"$f":"(ABS(M5)-ABS(P8))*60","v":41.688247639762366}]
[null,"Coordonnées Géographiques",null,null,null,null,null,null,null,null,null,"Coordonnées Géographiques"]
[null,"Latitude",null,null,null,"Longitude",null,null,null,"Elévation",null,"Latitude",null,null,null,"Longitude",null,null,null,"Elévation"]
[null,{"$f":"TRUNC(B5,0)","v":41},{"$f":"TRUNC((ABS(B5)-ABS(B8))*60)","v":6},{"$f":"(D5-C8)*60","v":29.063872287337631},{"$f":"IF(B5<0,\"S\",\"N\")","v":"N"},{"$f":"TRUNC(C5,0)","v":2},{"$f":"TRUNC((ABS(C5)-ABS(F8))*60)","v":41},{"$f":"(H5-G8)*60","v":41.294858385741975},{"$f":"IF(C5<0,\"W\",\"E\")","v":"E"},0,null,{"$f":"TRUNC(L5,0)","v":41},{"$f":"TRUNC((ABS(L5)-ABS(L8))*60)","v":6},{"$f":"(N5-M8)*60","v":29.063872287337631},{"$f":"IF(L5<0,\"S\",\"N\")","v":"N"},{"$f":"TRUNC(M5,0)","v":2},{"$f":"TRUNC((ABS(M5)-ABS(P8))*60)","v":41},{"$f":"(R5-Q8)*60","v":41.294858385741975},{"$f":"IF(M5<0,\"W\",\"E\")","v":"E"},{"$f":"CaGeEle2(L28,P28,T28)","v":-9.3132257461547852E-10}]
[null,{"$f":"B7","v":"Latitude"},"Latitude",null,null,{"$f":"F7","v":"Longitude"},"Longitude",null,null,null,null,{"$f":"L7","v":"Latitude"},"Latitude",null,null,{"$f":"P7","v":"Longitude"},"Longitude"]
[null,{"$f":"B8","v":41},{"$f":"TRUNC(B5,0)","v":41},{"$f":"ABS(B5-TRUNC(B5,0))*60","v":6.4843978714556272},{"$f":"IF(B5<0,\"S\",\"N\")","v":"N"},{"$f":"F8","v":2},{"$f":"TRUNC(C5,0)","v":2},{"$f":"ABS(C5-F8)*60","v":41.688247639762366},{"$f":"IF(C5<0,\"W\",\"E\")","v":"E"},null,null,{"$f":"L8","v":41},{"$f":"TRUNC(L5,0)","v":41},{"$f":"ABS(L5-TRUNC(L5,0))*60","v":6.4843978714556272},{"$f":"IF(L5<0,\"S\",\"N\")","v":"N"},{"$f":"P8","v":2},{"$f":"TRUNC(M5,0)","v":2},{"$f":"ABS(M5-P8)*60","v":41.688247639762366},{"$f":"IF(M5<0,\"W\",\"E\")","v":"E"}]
[null,{"$f":"B8","v":41},{"$f":"C8+D8/60","v":6.4843978714556272},null,null,{"$f":"F8","v":2},{"$f":"G8+H8/60","v":41.688247639762366},null,null,null,null,{"$f":"L8","v":41},{"$f":"M8+N8/60","v":6.4843978714556272},null,null,{"$f":"P8","v":2},{"$f":"Q8+R8/60","v":41.688247639762366}]
[null,{"$f":"Geodesies!E12&\" Zone \"&Geodesies!E15","v":"UTM N Zone 30"},null,null,null,null,null,null,null,null,null,{"$f":"Geodesies!N12&\" Zone \"&Geodesies!N15","v":"UTM N Zone 31"}]
[null,"Easting",null,null,null,"Northing",null,null,null,null,null,"Easting",null,null,null,"Northing"]
[null,{"$f":"GeUtX1(B11,C11,F11,G11)","v":978016.92777299532},null,null,null,{"$f":"GeUtY1(B11,C11,F11,G11)","v":4563540.2527499702},null,null,null,null,null,{"$f":"GeUtX2(L11,M11,P11,Q11)","v":474387.85517606401},null,null,null,{"$f":"GeUtY2(L11,M11,P11,Q11)","v":4547938.4049415281}]
[null,"Convergeance",null,null,null,"Fact. d'Echelle",null,null,null,null,null,"Convergeance",null,null,null,"Fact. d'Echelle"]
[null,{"$f":"TRUNC(B17,0)","v":3},{"$f":"TRUNC((ABS(B17)-ABS(B16))*60)","v":45},{"$f":"(D17-C16)*60","v":4.7509095666555368},{"$f":"IF(B17<0,\"W\",\"E\")","v":"E"},{"$f":"FactEchelle1(B14,F14)","v":1.0018533482766085},null,null,null,null,null,{"$f":"TRUNC(L17,0)","v":0},{"$f":"TRUNC((ABS(L17)-ABS(L16))*60)","v":12},{"$f":"(N17-M16)*60","v":2.3821414716852374},{"$f":"IF(L17<0,\"W\",\"E\")","v":"W"},{"$f":"FactEchelle2(L14,P14)","v":0.99904647762739796}]
[null,{"$f":"convergence1(B14,F14)","v":3.7513196971018488},null,{"$f":"(ABS(B17)-ABS(B16))*60","v":45.079181826110926},null,null,null,null,null,null,null,{"$f":"convergence2(L14,P14)","v":-0.20066170596435701},null,{"$f":"(ABS(L17)-ABS(L16))*60","v":12.039702357861421}]
[null,{"$f":"\"Mercator \"&Geodesies!E23&Geodesies!E24&\" \"&Geodesies!E27&Geodesies!E28","v":"Mercator 3E 0N"},null,null,null,null,null,null,null,null,null,{"$f":"\"Mercator \"&Geodesies!N23&Geodesies!N24&\" \"&Geodesies!N27&Geodesies!N28","v":"Mercator 9E 0N"}]
[null,"Easting",null,null,null,"Northing",null,null,null,null,null,"Easting",null,null,null,"Northing"]
[null,300000,null,null,null,5000000,null,null,null,null,null,{"$f":"GeMeX2(P11,Q11)","v":300000},null,null,null,{"$f":"GeMeY2(L11,M11)","v":4999999.9999999739}]
[]
[null,{"$f":"Geodesies!E36","v":"Lambert IV"},null,null,null,null,null,null,null,null,null,{"$f":"Geodesies!N36","v":"Lambert 4 Carto"}]
[null,"X",null,null,null,"Y",null,null,null,null,null,"X",null,null,null,"Y"]
[null,{"$f":"GeLaX1(B11,C11,F11,G11)","v":30272.331026519169},null,null,null,{"$f":"GeLaY1(B11,C11,F11,G11)","v":68545.527331908233},null,null,null,null,null,{"$f":"GeLaX2(L11,M11,P11,Q11)","v":30274.352529519962},null,null,null,{"$f":"GeLaY2(L11,M11,P11,Q11)","v":4068537.632181135}]
[]
[null,"Cartésiens",null,null,null,null,null,null,null,null,null,"Cartésiens"]
[null,"X",null,null,null,"Y",null,null,null,"Z",null,"X",null,null,null,"Y",null,null,null,"Z"]
[null,{"$f":"GeCaX(B11,C11,F11,G11,J8)","v":4807584.5133094369},null,null,null,{"$f":"GeCaY(B11,C11,F11,G11,J8)","v":226282.98644375309},null,null,null,{"$f":"GeCaZ(B11,C11,F11,G11,J8)","v":4171187.6709254822},null,{"$f":"CaCaX(B28,F28,J28)","v":4807584.5133094369},null,null,null,{"$f":"CaCaY(B28,F28,J28)","v":226282.98644375309},null,null,null,{"$f":"CaCaZ(B28,F28,J28)","v":4171187.6709254822}]

{"sheet":"Lambert","index":5,"n_rows":28,"n_cols":20,"rows_kept":28,"cut":false,"hidden":false,"merged":[[3,1,3,3],[3,4,3,9],[3,11,3,13],[3,14,3,19],[0,0,0,20],[2,1,2,3],[2,4,2,9],[2,11,2,13],[2,14,2,19],[5,1,5,9],[5,11,5,19],[6,1,6,4],[6,5,6,8],[6,11,6,14],[6,15,6,18],[11,1,11,8],[11,11,11,18],[12,1,12,4],[12,5,12,8],[12,11,12,14],[12,15,12,18],[13,1,13,4],[13,5,13,8],[13,11,13,14],[13,15,13,18],[14,1,14,4],[14,5,14,8],[14,11,14,14],[14,15,14,18],[15,5,15,8],[15,15,15,18],[17,1,17,8],[17,11,17,18],[18,1,18,4],[18,5,18,8],[18,11,18,14],[18,15,18,18],[19,1,19,4],[19,5,19,8],[19,11,19,14],[19,15,19,18],[21,1,21,8],[21,11,21,18],[22,11,22,14],[22,15,22,18],[23,1,23,4],[23,5,23,8],[23,11,23,14],[23,15,23,18],[8,2,8,4],[8,6,8,8],[8,12,8,14],[8,16,8,18],[27,1,27,4],[27,5,27,8],[27,11,27,14],[27,15,27,18],[25,1,25,9],[25,11,25,19],[26,1,26,4],[26,5,26,8],[26,11,26,14],[26,15,26,18],[22,1,22,4],[22,5,22,8]]}
["Conversion de Lamberts"]
[]
[null,"Géodésie 1",null,null,{"$f":"Geodesies!E4","v":"France / IGN/NTF"},null,null,null,null,null,null,"Géodésie 2",null,null,{"$f":"Geodesies!N4","v":"France / IGN/NTF"}]
[null,"Sphéroïde",null,null,{"$f":"Geodesies!E5","v":"CLARKE 1880 IGN"},null,null,null,null,null,null,"Sphéroïde",null,null,{"$f":"Geodesies!N5","v":"CLARKE 1880 IGN"}]
[null,{"$f":"LaGeLat(B24,F24)","v":42.164999990113117},{"$f":"LaGeLon(B24,F24)","v":2.3372291700000001},{"$f":"(ABS(B5)-ABS(B8))*60","v":9.8999994067870034},null,null,null,{"$f":"(ABS(C5)-ABS(F8))*60","v":20.233750200000003},null,null,null,{"$f":"CaGeLat2(L28,P28,T28)","v":42.164999990113117},{"$f":"CaGeLon2(L28,P28)","v":2.3372291700000005},{"$f":"(ABS(L5)-ABS(L8))*60","v":9.8999994067870034},null,null,null,{"$f":"(ABS(M5)-ABS(P8))*60","v":20.233750200000031}]
[null,"Coordonnées Géographiques",null,null,null,null,null,null,null,null,null,"Coordonnées Géographiques"]
[null,"Latitude",null,null,null,"Longitude",null,null,null,"Elévation",null,"Latitude",null,null,null,"Longitude",null,null,null,"Elévation"]
[null,{"$f":"TRUNC(B5,0)","v":42},{"$f":"TRUNC((ABS(B5)-ABS(B8))*60)","v":9},{"$f":"(D5-C8)*60","v":53.999964407220205},{"$f":"IF(B5<0,\"S\",\"N\")","v":"N"},{"$f":"TRUNC(C5,0)","v":2},{"$f":"TRUNC((ABS(C5)-ABS(F8))*60)","v":20},{"$f":"(H5-G8)*60","v":14.025012000000174},{"$f":"IF(C5<0,\"W\",\"E\")","v":"E"},100,null,{"$f":"TRUNC(L5,0)","v":42},{"$f":"TRUNC((ABS(L5)-ABS(L8))*60)","v":9},{"$f":"(N5-M8)*60","v":53.999964407220205},{"$f":"IF(L5<0,\"S\",\"N\")","v":"N"},{"$f":"TRUNC(M5,0)","v":2},{"$f":"TRUNC((ABS(M5)-ABS(P8))*60)","v":20},{"$f":"(R5-Q8)*60","v":14.02501200000188},{"$f":"IF(M5<0,\"W\",\"E\")","v":"E"},{"$f":"CaGeEle2(L28,P28,T28)","v":100.00000000093132}]
[null,{"$f":"B7","v":"Latitude"},"Latitude",null,null,{"$f":"F7","v":"Longitude"},"Longitude",null,null,null,null,{"$f":"L7","v":"Latitude"},"Latitude",null,null,{"$f":"P7","v":"Longitude"},"Longitude"]
[null,{"$f":"B8","v":42},{"$f":"TRUNC(B5,0)","v":42},{"$f":"ABS(B5-TRUNC(B5,0))*60","v":9.8999994067870034},{"$f":"IF(B5<0,\"S\",\"N\")","v":"N"},{"$f":"F8","v":2},{"$f":"TRUNC(C5,0)","v":2},{"$f":"ABS(C5-F8)*60","v":20.233750200000003},{"$f":"IF(C5<0,\"W\",\"E\")","v":"E"},null,null,{"$f":"L8","v":42},{"$f":"TRUNC(L5,0)","v":42},{"$f":"ABS(L5-TRUNC(L5,0))*60","v":9.8999994067870034},{"$f":"IF(L5<0,\"S\",\"N\")","v":"N"},{"$f":"P8","v":2},{"$f":"TRUNC(M5,0)","v":2},{"$f":"ABS(M5-P8)*60","v":20.233750200000031},{"$f":"IF(M5<0,\"W\",\"E\")","v":"E"}]
[null,{"$f":"B8","v":42},{"$f":"C8+D8/60","v":9.8999994067870034},null,null,{"$f":"F8","v":2},{"$f":"G8+H8/60","v":20.233750200000003},null,null,null,null,{"$f":"L8","v":42},{"$f":"M8+N8/60","v":9.8999994067870034},null,null,{"$f":"P8","v":2},{"$f":"Q8+R8/60","v":20.233750200000031}]
[null,{"$f":"Geodesies!E12&\" Zone \"&Geodesies!E15","v":"UTM N Zone 30"},null,null,null,null,null,null,null,null,null,{"$f":"Geodesies!N12&\" Zone \"&Geodesies!N15","v":"UTM N Zone 31"}]
[null,"Easting",null,null,null,"Northing",null,null,null,null,null,"Easting",null,null,null,"Northing"]
[null,{"$f":"GeUtX1(B11,C11,F11,G11)","v":445281.24693381076},null,null,null,{"$f":"GeUtY1(B11,C11,F11,G11)","v":-425494.04233645607},null,null,null,null,null,{"$f":"GeUtX2(L11,M11,P11,Q11)","v":445281.24693381082},null,null,null,{"$f":"GeUtY2(L11,M11,P11,Q11)","v":4665379.6693863869}]
[null,"Convergeance",null,null,null,"Fact. d'Echelle",null,null,null,null,null,"Convergeance",null,null,null,"Fact. d'Echelle"]
[null,{"$f":"TRUNC(B17,0)","v":0},{"$f":"TRUNC((ABS(B17)-ABS(B16))*60)","v":26},{"$f":"(D17-C16)*60","v":41.668188631708034},{"$f":"IF(B17<0,\"W\",\"E\")","v":"W"},{"$f":"FactEchelle1(B14,F14)","v":0.99907526019967874},null,null,null,null,null,{"$f":"TRUNC(L17,0)","v":0},{"$f":"TRUNC((ABS(L17)-ABS(L16))*60)","v":26},{"$f":"(N17-M16)*60","v":41.668188603880907},{"$f":"IF(L17<0,\"W\",\"E\")","v":"W"},{"$f":"FactEchelle2(L14,P14)","v":0.99907526019967874}]
[null,{"$f":"convergence1(B14,F14)","v":-0.44490783017547447},null,{"$f":"(ABS(B17)-ABS(B16))*60","v":26.694469810528467},null,null,null,null,null,null,null,{"$f":"convergence2(L14,P14)","v":-0.44490783016774471},null,{"$f":"(ABS(L17)-ABS(L16))*60","v":26.694469810064682}]
[null,{"$f":"\"Mercator \"&Geodesies!E23&Geodesies!E24&\" \"&Geodesies!E27&Geodesies!E28","v":"Mercator 3E 0N"},null,null,null,null,null,null,null,null,null,{"$f":"\"Mercator \"&Geodesies!N23&Geodesies!N24&\" \"&Geodesies!N27&Geodesies!N28","v":"Mercator 9E 0N"}]
[null,"Easting",null,null,null,"Northing",null,null,null,null,null,"Easting",null,null,null,"Northing"]
[null,{"$f":"GeMeX1(F11,G11)","v":260192.84440345506},null,null,null,{"$f":"GeMeY1(B11,C11)","v":5156840.4331879057},null,null,null,null,null,{"$f":"GeMeX2(P11,Q11)","v":260192.84440345512},null,null,null,{"$f":"GeMeY2(L11,M11)","v":5156840.4331879057}]
[]
[null,{"$f":"Geodesies!E36","v":"Lambert IV"},null,null,null,null,null,null,null,null,null,{"$f":"Geodesies!N36","v":"Lambert 4 Carto"}]
[null,"X",null,null,null,"Y",null,null,null,null,null,"X",null,null,null,"Y"]
[null,234.358,null,null,null,185861.36900000001,null,null,null,null,null,{"$f":"GeLaX2(L11,M11,P11,Q11)","v":234.35800000003286},null,null,null,{"$f":"GeLaY2(L11,M11,P11,Q11)","v":4185861.3679018822}]
[]
[null,"Cartésiens",null,null,null,null,null,null,null,null,null,"Cartésiens"]
[null,"X",null,null,null,"Y",null,null,null,"Z",null,"X",null,null,null,"Y",null,null,null,"Z"]
[null,{"$f":"GeCaX(B11,C11,F11,G11,J8)","v":4731051.1365731647},null,null,null,{"$f":"GeCaY(B11,C11,F11,G11,J8)","v":193097.78506762936},null,null,null,{"$f":"GeCaZ(B11,C11,F11,G11,J8)","v":4258985.2488196827},null,{"$f":"CaCaX(B28,F28,J28)","v":4731051.1365731647},null,null,null,{"$f":"CaCaY(B28,F28,J28)","v":193097.78506762936},null,null,null,{"$f":"CaCaZ(B28,F28,J28)","v":4258985.2488196827}]

{"sheet":"Cartesiens","index":6,"n_rows":28,"n_cols":20,"rows_kept":28,"cut":false,"hidden":false,"merged":[[11,1,11,8],[11,11,11,18],[0,0,0,20],[2,1,2,3],[2,4,2,9],[2,11,2,13],[2,14,2,19],[3,1,3,3],[3,4,3,9],[3,11,3,13],[3,14,3,19],[5,1,5,9],[6,1,6,4],[6,5,6,8],[6,11,6,14],[6,15,6,18],[12,1,12,4],[12,5,12,8],[12,11,12,14],[12,15,12,18],[13,1,13,4],[13,5,13,8],[13,11,13,14],[13,15,13,18],[14,5,14,8],[14,15,14,18],[15,5,15,8],[15,15,15,18],[17,1,17,8],[17,11,17,18],[18,11,18,14],[18,15,18,18],[19,1,19,4],[19,5,19,8],[19,11,19,14],[19,15,19,18],[27,1,27,4],[27,5,27,8],[27,11,27,14],[27,15,27,18],[23,1,23,4],[23,5,23,8],[23,11,23,14],[23,15,23,18],[25,1,25,9],[25,11,25,19],[8,2,8,4],[8,6,8,8],[8,12,8,14],[8,16,8,18],[26,1,26,4],[26,5,26,8],[26,11,26,14],[26,15,26,18],[21,1,21,8],[21,11,21,18],[22,1,22,4],[22,5,22,8],[22,11,22,14],[22,15,22,18],[18,1,18,4],[18,5,18,8]]}
["Conversion de Cartésiens"]
[]
[null,"Géodésie 1",null,null,{"$f":"Geodesies!E4","v":"France / IGN/NTF"},null,null,null,null,null,null,"Géodésie 2",null,null,{"$f":"Geodesies!N4","v":"France / IGN/NTF"}]
[null,"Sphéroïde",null,null,{"$f":"Geodesies!E5","v":"CLARKE 1880 IGN"},null,null,null,null,null,null,"Sphéroïde",null,null,{"$f":"Geodesies!N5","v":"CLARKE 1880 IGN"}]
[null,{"$f":"CaGeLat1(B28,F28,J28)","v":48.600000000011683},{"$f":"CaGeLon1(B28,F28)","v":7.7372222222228499},{"$f":"(ABS(B5)-ABS(B8))*60","v":36.000000000700965},null,null,null,{"$f":"(ABS(C5)-ABS(F8))*60","v":44.233333333370993},null,null,null,{"$f":"CaGeLat2(L28,P28,T28)","v":48.600000000011683},{"$f":"CaGeLon2(L28,P28)","v":7.7372222222228499},{"$f":"(ABS(L5)-ABS(L8))*60","v":36.000000000700965},null,null,null,{"$f":"(ABS(M5)-ABS(P8))*60","v":44.233333333370993}]
[null,"Coordonnées Géographiques",null,null,null,null,null,null,null,null,null,"Coordonnées Géographiques"]
[null,"Latitude",null,null,null,"Longitude",null,null,null,"Elévation",null,"Latitude",null,null,null,"Longitude",null,null,null,"Elévation"]
[null,{"$f":"TRUNC(B5,0)","v":48},{"$f":"TRUNC((ABS(B5)-ABS(B8))*60)","v":36},{"$f":"(D5-C8)*60","v":4.2057877180923242E-8},{"$f":"IF(B5<0,\"S\",\"N\")","v":"N"},{"$f":"TRUNC(C5,0)","v":7},{"$f":"TRUNC((ABS(C5)-ABS(F8))*60)","v":44},{"$f":"(H5-G8)*60","v":14.000000002259583},{"$f":"IF(C5<0,\"W\",\"E\")","v":"E"},{"$f":"CaGeEle1(B28,F28,J28)","v":-9.6354633569717407E-6},null,{"$f":"TRUNC(L5,0)","v":48},{"$f":"TRUNC((ABS(L5)-ABS(L8))*60)","v":36},{"$f":"(N5-M8)*60","v":4.2057877180923242E-8},{"$f":"IF(L5<0,\"S\",\"N\")","v":"N"},{"$f":"TRUNC(M5,0)","v":7},{"$f":"TRUNC((ABS(M5)-ABS(P8))*60)","v":44},{"$f":"(R5-Q8)*60","v":14.000000002259583},{"$f":"IF(M5<0,\"W\",\"E\")","v":"E"},{"$f":"CaGeEle2(L28,P28,T28)","v":-9.6354633569717407E-6}]
[null,{"$f":"B7","v":"Latitude"},"Latitude",null,null,{"$f":"F7","v":"Longitude"},"Longitude",null,null,null,null,{"$f":"L7","v":"Latitude"},"Latitude",null,null,{"$f":"P7","v":"Longitude"},"Longitude"]
[null,{"$f":"B8","v":48},{"$f":"TRUNC(B5,0)","v":48},{"$f":"ABS(B5-TRUNC(B5,0))*60","v":36.000000000700965},{"$f":"IF(B5<0,\"S\",\"N\")","v":"N"},{"$f":"F8","v":7},{"$f":"TRUNC(C5,0)","v":7},{"$f":"ABS(C5-F8)*60","v":44.233333333370993},{"$f":"IF(C5<0,\"W\",\"E\")","v":"E"},null,null,{"$f":"L8","v":48},{"$f":"TRUNC(L5,0)","v":48},{"$f":"ABS(L5-TRUNC(L5,0))*60","v":36.000000000700965},{"$f":"IF(L5<0,\"S\",\"N\")","v":"N"},{"$f":"P8","v":7},{"$f":"TRUNC(M5,0)","v":7},{"$f":"ABS(M5-P8)*60","v":44.233333333370993},{"$f":"IF(M5<0,\"W\",\"E\")","v":"E"}]
[null,{"$f":"B8","v":48},{"$f":"C8+D8/60","v":36.000000000700965},null,null,{"$f":"F8","v":7},{"$f":"G8+H8/60","v":44.233333333370993},null,null,null,null,{"$f":"L8","v":48},{"$f":"M8+N8/60","v":36.000000000700965},null,null,{"$f":"P8","v":7},{"$f":"Q8+R8/60","v":44.233333333370993}]
[null,{"$f":"Geodesies!E12&\" Zone \"&Geodesies!E15","v":"UTM N Zone 30"},null,null,null,null,null,null,null,null,null,{"$f":"Geodesies!N12&\" Zone \"&Geodesies!N15","v":"UTM N Zone 31"}]
[null,"Easting",null,null,null,"Northing",null,null,null,null,null,"Easting",null,null,null,"Northing"]
[null,{"$f":"GeUtX1(B11,C11,F11,G11)","v":1290610.3792522328},null,null,null,{"$f":"GeUtY1(B11,C11,F11,G11)","v":5435530.4054280659},null,null,null,null,null,{"$f":"GeUtX2(L11,M11,P11,Q11)","v":849029.43088625674},null,null,null,{"$f":"GeUtY2(L11,M11,P11,Q11)","v":5390488.9941558028}]
[null,"Convergeance",null,null,null,"Fact. d'Echelle",null,null,null,null,null,"Convergeance",null,null,null,"Fact. d'Echelle"]
[null,{"$f":"TRUNC(B17,0)","v":8},{"$f":"TRUNC((ABS(B17)-ABS(B16))*60)","v":5},{"$f":"(D17-C16)*60","v":45.021703299112659},{"$f":"IF(B17<0,\"W\",\"E\")","v":"E"},{"$f":"FactEchelle1(B14,F14)","v":1.0067306685942414},null,null,null,null,null,{"$f":"TRUNC(L17,0)","v":3},{"$f":"TRUNC((ABS(L17)-ABS(L16))*60)","v":33},{"$f":"(N17-M16)*60","v":25.262770095324498},{"$f":"IF(L17<0,\"W\",\"E\")","v":"E"},{"$f":"FactEchelle2(L14,P14)","v":1.0005361595605033}]
[null,{"$f":"convergence1(B14,F14)","v":8.0958393620275313},null,{"$f":"(ABS(B17)-ABS(B16))*60","v":5.7503617216518776},null,null,null,null,null,null,null,{"$f":"convergence2(L14,P14)","v":3.5570174361375901},null,{"$f":"(ABS(L17)-ABS(L16))*60","v":33.421046168255408}]
[null,{"$f":"\"Mercator \"&Geodesies!E23&Geodesies!E24&\" \"&Geodesies!E27&Geodesies!E28","v":"Mercator 3E 0N"},null,null,null,null,null,null,null,null,null,{"$f":"\"Mercator \"&Geodesies!N23&Geodesies!N24&\" \"&Geodesies!N27&Geodesies!N28","v":"Mercator 9E 0N"}]
[null,"Easting",null,null,null,"Northing",null,null,null,null,null,"Easting",null,null,null,"Northing"]
[null,{"$f":"GeMeX1(F11,G11)","v":303979.52480352193},null,null,null,{"$f":"GeMeY1(B11,C11)","v":6174993.4136799444},null,null,null,null,null,{"$f":"GeMeX2(P11,Q11)","v":861348.9355781849},null,null,null,{"$f":"GeMeY2(L11,M11)","v":6174993.4136799444}]
[]
[null,{"$f":"Geodesies!E36","v":"Lambert IV"},null,null,null,null,null,null,null,null,null,{"$f":"Geodesies!N36","v":"Lambert 4 Carto"}]
[null,"X",null,null,null,"Y",null,null,null,null,null,"X",null,null,null,"Y"]
[null,{"$f":"GeLaX1(B11,C11,F11,G11)","v":400829.05637792859},null,null,null,{"$f":"GeLaY1(B11,C11,F11,G11)","v":915168.84233407956},null,null,null,null,null,{"$f":"GeLaX2(L11,M11,P11,Q11)","v":400856.0156998561},null,null,null,{"$f":"GeLaY2(L11,M11,P11,Q11)","v":4915217.9234503228}]
[]
[null,"Cartésiens",null,null,null,null,null,null,null,null,null,"Cartésiens"]
[null,"X",null,null,null,"Y",null,null,null,"Z",null,"X",null,null,null,"Y",null,null,null,"Z"]
[null,4187633.8864099998,null,null,null,568960.78884000005,null,null,null,4760966.2094400004,null,{"$f":"CaCaX(B28,F28,J28)","v":4187633.8864099998},null,null,null,{"$f":"CaCaY(B28,F28,J28)","v":568960.78884000005},null,null,null,{"$f":"CaCaZ(B28,F28,J28)","v":4760966.2094400004}]

{"sheet":"Spheroides","index":7,"n_rows":56,"n_cols":8,"rows_kept":56,"cut":false,"hidden":true,"merged":[[0,0,0,8]]}
["Liste des Ellipsoides Disponibles"]
[]
[]
[]
[]
[]
[null,null,"Nom","Demi Grand","Demi Petit","e2","n","1 / f"]
[null,1,"AIRY",6377563.3959999997,6356256.909,{"$f":"POWER(1/D8*(SQRT((D8*D8)-(E8*E8))),2)","v":6.6705400741490836E-3},1.6732202503250534E-3,{"$f":"1/((D8-E8)/D8)","v":299.32496126649505}]
[null,2,"AIRY MOD",6377340.1890000002,6356034.4479999999,6.6705399807736503E-3,1.6732203054869081E-3,299.32496546352854]
[null,3,"AUSTRALIAN NATIONAL 1967/84",6378160,6356774.7189999996,6.694541915624532E-3,null,{"$f":"1/((D10-E10)/D10)","v":298.24999727615801}]
[null,4,"BESSEL 1841",6377397.1550000003,6356078.9630000005,6.6743721749749326E-3,1.6741847868128074E-3,299.15281535132334]
[null,5,"BESSEL 1841 MOD",6377483.8650000002,6356165.3830000004,6.6743722212770787E-3,1.6741847984660181E-3,299.15281327254201]
[null,6,"BESSEL NGO",6377492.0180000002,6356173.5089999996,6.6743721420039794E-3,null,299.152816831601]
[null,7,"BESSEL RD / POTSDAM",6377397.1550000003,6356078.9630000005,6.6743721749749326E-3,null,299.15281535132334]
[null,8,"BROADCAST",6378135,6356750.5199999996,6.6943177832963279E-3,null,298.25999977553192]
[null,9,"CLARKE 1856",6378235.5999999996,6356560.1399999997,6.785145919996286E-3,null,294.26068005015861]
[null,10,"CLARKE 1866",6378206.4000000004,6356583.7999999998,6.7686579972911819E-3,1.6979156829769022E-3,294.97869821389821]
[null,11,"CLARKE 1880",6378249.1449999996,6356514.8700000001,6.8035111421552033E-3,1.7066884768653044E-3,293.46500607911531]
[null,12,"CLARKE 1880 IGN",6378249.2000000002,6356515,{"$f":"POWER(1/D19*(SQRT((D19*D19)-(E19*E19))),2)","v":6.8034876462998934E-3},null,293.46602129362691]
[null,13,"CLARKE 1880 MOD",6378249.1449999996,6356514.8700000001,{"$f":"POWER(1/D20*(SQRT((D20*D20)-(E20*E20))),2)","v":6.8035111421552033E-3},1.7066884768653044E-3,293.46500607911531]
[null,14,"CLARKE 1880 (PALESTINE)",6378300.7819999997,6356566.4270000001,{"$f":"POWER(1/D21*(SQRT((D21*D21)-(E21*E21))),2)","v":6.803481156342152E-3},null,293.46630171450414]
[null,15,"DANISH 1876  / ANDRAE",6377104.4299999997,6355847.415,6.6555556284901502E-3,null,299.99999670697417]
[null,16,"EVEREST (INDE) METRIQUE",6377301.2429999998,6356100.2300000004,6.6378461201175376E-3,null,300.80172315352098]
[null,17,"EVEREST (MALAYA)",6377295.6639999999,6356094.6679999996,6.637846603695206E-3,null,300.80170120309049]
[null,18,"EVEREST 1830",6377276.3449999997,6356075.4129999997,6.6378466740345783E-3,1.6649922505031004E-3,300.80169801025681]
[null,19,"EVEREST 1830 (MOD.)",6377298.5609999998,6356097.5549999997,6.6378467190551368E-3,null,300.80169596669066]
[null,20,"EVEREST BORNEO",6377298.5559999999,6356097.5549999997,6.6378451614016471E-3,null,300.80176667129774]
[null,21,"EVEREST MOD.",6377304.0630000001,6356103.0389999999,6.6378466280601449E-3,null,300.80170009712441]
[null,22,"FISHER 1960 (MERCURY)",6378166,6356784.284,6.6934215001796154E-3,null,298.30000548131846]
[null,23,"FISHER 1968",6378150,6356768.3370000003,6.6934216993408307E-3,null,298.29999659054056]
[null,24,"FISCHER MOD",6378160,6356774.7189999996,6.694541915624532E-3,1.6792611404669755E-3,298.24999727615801]
[null,25,"FISHER MOD. 1960",6378155,6356773.3200000003,6.6934217738298723E-3,null,298.29999326526678]
[null,26,"GRS 67",6378160,6356774.5159999998,6.694605356917795E-3,null,298.24716616186703]
[null,27,"GRS 80",6378137,6356752.3140000002,6.6943800667646578E-3,null,298.25722014342756]
[null,28,"HELMERT 1906",6378200,6356818,6.6934746345492999E-3,1.6789925228217189E-3,298.29763352352444]
[null,29,"HOUGH",6378270,6356794.3430000003,6.7226701580694282E-3,1.6863406749730355E-3,296.99999399320365]
[null,30,"INTERNATIONAL",6378388,6356911.9461000003,6.72267003106654E-3,1.6863406508729228E-3,296.99999961352711]
[null,31,"JEFFREYS 1948",6378099,6356631,6.7204571463943836E-3,null,297.09795975405251]
[null,32,"KRASSOVSKY",6378245,6356863,6.6934274898192208E-3,1.6789806572508061E-3,298.29973809746514]
[null,33,"PRECISE",6378145,6356759.7690000003,6.6945420073107756E-3,1.6792611635429559E-3,298.2499931845532]
[null,34,"REF ELLIPSOIDE 1967",6378160,6356774.7189999996,6.694541915624532E-3,1.6792611404669755E-3,298.24999727615801]
[null,35,"S AMERICA 1969",6378160,6356774.7189999996,6.694541915624532E-3,1.6792611404669755E-3,298.24999727615801]
[null,36,"STRUVE 1860",6378298.2999999998,6356657.1430000002,6.7743596975477745E-3,null,294.73000450022613]
[null,37,"SVANBERG",6376797,6355837.9709999999,6.5627258654816379E-3,null,304.25059290675966]
[null,38,"WAR OFFICE 1924",6378300,6356751.6890000002,6.7453433754114476E-3,null,295.99999740119182]
[null,39,"WGS 60",6378165,6356783.2869999995,6.6934216102894064E-3,null,298.30000056589779]
[null,40,"WGS 66",6378145,6356759.7690000003,6.6945420073107756E-3,null,298.2499931845532]
[null,41,"WGS 72",6378135,6356750.5199999996,6.6943177832963279E-3,1.6792047299063939E-3,298.25999977553192]
[null,42,"WGS 84",6378137,6356752.3140000002,6.6943800667646578E-3,1.6792204056685965E-3,298.25722014342756]
[null,43]
[null,44]
[null,45]
[null,46]
[]
[]
[null,null," "]

{"sheet":"Table Datum Shifts","index":8,"n_rows":183,"n_cols":10,"rows_kept":183,"cut":false,"hidden":true,"merged":[]}
[6,null,181]
[180,"Zone / Datum","Spheroide","Dx","Dy","Dz","Rx","Ry","Rz","ppm"]
[null,"Afrique du Sud / S Africa Cape","Clarke 1880 Mod.",-136,-108,-292,0,0,0,0]
[null,"Alaska / NAD27","Clarke 1866",-12.62,156.56,180.52,0,0,0.81399999999999995,0.42699999999999999]
[null,"Alaska / NAD27","Clarke 1866",-5,135,172,0,0,0,0]
[null,"Alaska / NAD83","GRS80",0,0,0,0,0,0,0]
[null,"Amerique Central / NAD83","GRS80",0,0,0,0,0,0,0]
[null,"Arabie Saoudite / Nahrwan","Clarke 1880 Mod.",-231,-196,482,0,0,0,0]
[null,"Argentine / Campo Inchauste","International",-148,136,90,0,0,0,0]
[null,"Argentine / S. America 1969","S America 1969",-57,1,-41,0,0,0,0]
[null,"Australie / Australian Geodetic 1966","RE 1967",-133,-48,148,0,0,0,0]
[null,"Australie / Australian Nat","RE 1967",-122,-41,150,0,0,0.55400000000000005,0.22700000000000001]
[null,"Australie / Autralian","RE 1984",-134,-48,149,0,0,0,0]
[null,"Bahreïn / Ain El Abl 1970","International",-150,-251,-2,0,0,0,0]
[null,"Bangladesh / Indian","Everest 1830",289,734,257,0,0,0,0]
[null,"Belize / NAD27","Clarke 1866",0,125,194,0,0,0,0]
[null,"Bolivie / Prov. S America 1956","International",-288,175,-376,0,0,0,0]
[null,"Bolivie / S. America 1969","S. America 1969",-57,1,-41,0,0,0,0]
[null,"Botswana / Cape Arc 1950","Clarke 1880 Mod",-138,-105,-289,0,0,0,0]
[null,"Bresil / S. America 1969","S. America 1969",-57,1,-41,0,0,0,0]
[null,"Brunei / Timbalai","Everest 1830",-689,691,-46,0,0,0,0]
[null,"Canada / NAD27","Clarke 1866",-10,158,187,0,0,0,0]
[null,"Canada / NAD27 (Canada)","Clarke 1866",-9,139,177.5,0,0,0.55400000000000005,0.22700000000000001]
[null,"Canal Panama / NAD27","Clarke 1866",0,125,201,0,0,0,0]
[null,"Chili / Prov. S Chilean 63","International",16,196,93,0,0,0,0]
[null,"Chili / S. America 1969","S. America 1969",-57,1,-41,0,0,0,0]
[null,"Chypre / ED50","International",-104,-101,-140,0,0,0,0]
[null,"Colombie / Bogota Observatory","International",307,304,-318,0,0,0,0]
[null,"Colombie / Prov. S America 1956","International",-288,175,-376,0,0,0,0]
[null,"Colombie / S. America 1969","S. America 1969",-57,1,-41,0,0,0,0]
[null,"Corée / Tokyo","Bessel 1841",-128,481,664,0,0,0,0]
[null,"Egypte / ED50","International",-130,-117,-151,0,0,0,0]
[null,"Egypte / Old Egyptian","Helmert 1906",-130,110,-13,0,0,0,0]
[null,"Emirats Arabes Unifies / Nahrwan","Clarke 1880 Mod",-249,-156,381,0,0,0,0]
[null,"Equateur / Prov. S American 1956","International",-288,175,-376,0,0,0,0]
[null,"Equateur / S American 1969","S American 1969",-57,1,-41,0,0,0,0]
[null,"Erytree / Massawa","Bessel 1841",639,405,60,0,0,0,0]
[null,"Espagne / ED50","International",-88,-109,-122,0,0,0,0]
[null,"Espiranto Santos / Santo (DOS)","International",170,42,84,0,0,0,0]
[null,"Ethiopie / Adindan","Clarke 1880 Mod",-165,-11,206,0,0,0,0]
[null,"Europe / ED50","International",-89.5,-93.8,-123.1,0,0,-0.156,1.2]
[null,"Europe / ED87","International",-83.11,-97.38,-117.23,-6.0000000000000001E-3,-4.4999999999999998E-2,4.3999999999999997E-2,0.122]
[null,"Finlande / ED50","International",-87,-95,-120,0,0,0,0]
[null,"France / ED50 IGN","International",-84,-97,-117,0,0,0,-14.19]
[null,"France / ED79 France","International",-83,-95,-116,0,0,0,-14.19]
[null,"France / IGN/NTF","Clarke 1880 (IGN)",-168,-60,320,0,0,0,-54.74]
[null,"France / RGF93","WGS84"]
[null,"France / WGS72 France","WGS72",0,12,6,0,0,0,3.1E-2]
[null,"Gabon / M'Paraloko","Clarke 1880",-77.900000000000006,-132.9,43.7,0,0,0,0]
[null,"Gizo / Gizo DOS 1968","International",230,-199,-752,0,0,0,0]
[null,"Grece / ED50","International",-84,-95,-130,0,0,0,0]
[null,"Groenland / NAD27","Clarke 1866",11,114,195,0,0,0,0]
[null,"Groenland / Qornoq","International",164,138,-189,0,0,0,0]
[null,"Guatemala / NAD27","Clarke 1866",0,125,194,0,0,0,0]
[null,"Guyana / Prov. S American 1956","International",-288,175,-376,0,0,0,0]
[null,"Guyana / S American 1969","S American",-57,1,-41,0,0,0,0]
[null,"Honduras / NAD27","Clarke 1866",0,125,194,0,0,0,0]
[null,"Hong Kong / Hong Kong 1963","International",-156,-271,-189,0,0,0,0]
[null,"Icelande / Hjorsey 1955","International",-73,46,-86,0,0,0,0]
[null,"Ile d'Efate et Erromango / Bellevue (IGN)","International",-127,-769,472,0,0,0,0]
[null,"Ile d'Oahu / ?","Clarke 1866",56,-268,-182.5,0,0,0.55400000000000005,0.22700000000000001]
[null,"Ile de Costa Rica / NAD27","Clarke 1866",0,125,194,0,0,0,0]
[null,"Ile de Cuba / NAD27","Clarke 1866",-7,152,178,0,0,0,0]
[null,"Ile de Guam / Guam 1963","Clarke 1966",252,-209,-751,0,0,0,0]
[null,"Ile de Kerguelen / Kerguelen","International",145,-187,103,0,0,0,0]
[null,"Ile de l'Ascension / Ascension 1958","International",-207,107,52,0,0,0,0]
[null,"Ile de la Barbades / NAD27","Clarke 1866",-7,152,178,0,0,0,0]
[null,"Ile de la Jamaique / NAD27","Clarke 1866",-7,152,178,0,0,0,0]
[null,"Ile de Madere / SE Base","International",-499,-249,314,0,0,0,0]
[null,"Ile de Sao Miguel / Sao Braz","International",-203,141,53,0,0,0,0]
[null,"Ile de Sardaigne / ED50","International",-97,-103,-120,0,0,0,0]
[null,"Ile de Sardaigne / Rome 1940","International",-255,-65,9,0,0,0,0]
[null,"Ile de Sicile / ED50","International",-97,-88,-135,0,0,0,0]
[null,"Ile de Tern / Asrto B4","International",114,-116,-333,0,0,0,0]
[null,"Ile Diego Garcia / ISTS 073 Astro 1969","International",208,-435,-229,0,0,0,0]
[null,"Ile Dominique / NAD27","Clarke 1866",-7,152,178,0,0,0,0]
[null,"Ile Georgia / DOS 1968","International",230,-199,-752,0,0,0,0]
[null,"Ile Grand Cayman / NAD27","Clarke 1866",-7,152,178,0,0,0,0]
[null,"Ile Guadalcanal / Gux 1 Astro","International",252,-209,-751,0,0,0,0]
[null,"Ile Hawaii Hawaii / Old Hawaiian","Clarke 1866",89,-279,-183,0,0,0,0]
[null,"Ile Hawaii Kauai / Old Hawaiian","Clarke 1866",45,-290,-172,0,0,0,0]
[null,"Ile Hawaii Maui / Old Hawaiian","Clarke 1866",65,-290,-190,0,0,0,0]
[null,"Ile Hawaii Oahu / Old Hawaiian","Clarke 1866",56,-284,-181,0,0,0,0]
[null,"Ile Iwo Jima / Astro Beacon East","International",145,75,-272,0,0,0,0]
[null,"Ile Johnson / Johnson Is 1961","International",191,-77,-204,0,0,0,0]
[null,"Ile Mahe / Ile Mahe 1971","Clarke 1880 Mod",41,-220,-134,0,0,0,0]
[null,"Ile Marcus / Asrto Stn 1952","International",124,-234,-25,0,0,0,0]
[null,"Ile Pitcairn / Pitcairn Astro 1967","International",185,165,42,0,0,0,0]
[null,"Ile Saint Helene / Astro DOS 7","International",-320,550,-494,0,0,0,0]
[null,"Ile Santa Maria / Sao Braz","International",-203,141,53,0,0,0,0]
[null,"Ile Tristan da Cunha / Tristan Astro","International",-632,438,-609,0,0,0,0]
[null,"Ile Viti Levu / Viti Levu 1916","Clarke 1880 Mod",51,391,-36,0,0,0,0]
[null,"Iles Bahamas / Cape Canaveral","Clarke 1866",-2,150,181,0,0,0,0]
[null,"Iles Bahamas / NAD27","Clarke 1866",-4,154,178,0,0,0,0]
[null,"Iles Caicos / NAD27","Clarke 1866",-7,152,178,0,0,0,0]
[null,"Iles Caiman / LC 5 Astro","Clarke 1866",42,124,147,0,0,0,0]
[null,"Iles Canaries / Pico de las Nieves","International",-307,-92,127,0,0,0,0]
[null,"Iles Chatam / Ile Chatam 1971","International",175,-38,113,0,0,0,0]
[null,"Iles Cocos / Australian","RE 1967",-491,-22,435,0,0,0,0]
[null,"Iles de Mascarenes / Reunion","International",94,-948,-1262,0,0,0,0]
[null,"Iles de Midway / Midway Astro 1961","International",912,-58,1227,0,0,0,0]
[null,"Iles de Paques / Iles de Paques 1967","International",211,147,111,0,0,0,0]
[null,"Iles des Açores / Observatorio 1966","International",-425,-169,81,0,0,0,0]
[null,"Iles des Açores / SW Base","International",-104,167,-38,0,0,0,0]
[null,"Iles des Bermudes / Bermuda 1957","Clarke 1866",-73,213,296,0,0,0,0]
[null,"Iles Falklands / Sapper Hill 1943","International",-355,16,74,0,0,0,0]
[null,"Iles Maldives / Gandajika Base","International",-133,-321,50,0,0,0,0]
[null,"Iles Marshall / Wake Eniwetok 1960","Hough",101,52,-39,0,0,0,0]
[null,"Iles Phoenix / Canton Astro 1966","International",298,-304,-375,0,0,0,0]
[null,"Iles Salvages / Marco Astro","International",-289,-124,60,0,0,0,0]
[null,"Iles Sous le Vent / NAD27","Clarke 1866",-7,152,178,0,0,0,0]
[null,"Iles Trinité & Tobago / Naparima (BWI)","International",-2,374,172,0,0,0,0]
[null,"Iles Trinité & Tobago / S. American 1969","S. American 1969",-57,1,-41,0,0,0,0]
[null,"Iles Vierges / Puerto Rico","Clarke 1866",11,72,-101,0,0,0,0]
[null,"Iran / ED50","International",-117,-132,-164,0,0,0,0]
[null,"Irelande / Ireland 1965","Airy Mod",506,-122,611,0,0,0,0]
[null,"Japon / Tokyo","Bessel 1841",-128,481,664,0,0,0,0]
[null,"Kenya / Cape Arc 1960","Clarke 1880 Mod",-161,-7,-300,0,0,0,0]
[null,"Lesotho / Cape Arc 1950","Clarke 1880 Mod",-125,-108,-295,0,0,0,0]
[null,"Liberia / Liberia 1964","Clarke 1880 Mod",-90,40,88,0,0,0,0]
[null,"Malaisie (Est) / Timbalia","Everest 1830",-689,691,-46,0,0,0,0]
[null,"Malaisie (Ouest) / Kertau 1948","Everest Mod",-11,851,5,0,0,0,0]
[null,"Malawi / Cape Arc 1950","Clarke 1880 Mod",-161,-73,-317,0,0,0,0]
[null,"Mali / Adindan","Clarke 1880 Mod",-163,-20,220,0,0,0,0]
[null,"Maroc / Merchich","Clarke 1880 Mod",31,146,47,0,0,0,0]
[null,"Maui / Maui","Clarke 1866",65,-272,-192.5,0,0,0.55400000000000005,0.22700000000000001]
[null,"Mexique / NAD27","Clarke 1866",-12,130,190,0,0,0,0]
[null,"Mindanao / Luzon","Clarke 1866",-133,-79,-72,0,0,0,0]
[null,"Monde / DOPPLER","Precise",0,0,4.5,0,0,0.81399999999999995,-0.6]
[null,"Monde / NWL10D","Broadcast",0,0,4.5,0,0,0.81399999999999995,-0.60199999999999998]
[null,"Monde / NWL9D","Precise",0,0,4.5,0,0,0.81399999999999995,-0.6]
[null,"Monde / WGS72","WGS72",0,0,4.5,0,0,0.55400000000000005,0.22700000000000001]
[null,"Monde / WGS84","WGS84",0,0,0,0,0,0,0]
[null,"Monde / WGS84 SEA","WGS84",0,0,0,0,0,0,0]
[null,"Namibie / Schwarzeck","Bessel 1841 Mod",616,97,-251,0,0,0,0]
[null,"Neherlandes / RD","Bessel RD"]
[null,"Nepal / Indian","Everst 1830",289,734,257,0,0,0,0]
[null,"Nicaragua / NAD27","Clarke 1866",0,125,194,0,0,0,0]
[null,"Nigeria / Minna","Clarke 1880 Mod",-92,-93,122,0,0,0,0]
[null,"Norvège / ED50","International",-87,-95,-120,0,0,0,0]
[null,"Norvège-Nord / ED50","International",-100.94,-96.58,-144.25,-0.82499999999999996,-7.4999999999999997E-2,-1.657,8.0000000000000002E-3]
[null,"Nouvelles Zelandes / GD 1949","International",84,-22,209,0,0,0,0]
[null,"Oman / Oman","Clarke 1880 Mod",-346,-1,224,0,0,0,0]
[null,"Paraguay / Chua Astro","International",-134,229,-29,0,0,0,0]
[null,"Paraguay / S American 1969","S American 1969",-57,1,-41,0,0,0,0]
[null,"Perou / Prov S American 1956","International",-288,175,-376,0,0,0,0]
[null,"Perou / S American 1969","S American 1969",-57,1,-41,0,0,0,0]
[null,"Phillipines / Luzon 1911","Clarke 1866",-133,-77,-51,0,0,0,0]
[null,"Portugal / ED50","International",-88,-109,-122,0,0,0,0]
[null,"Puerto Rico / Puerto Rico","Clarke 1866",11,72,-101,0,0,0,0]
[null,"Qatar / Nahrwan","Clarke 1880 Mod",-249.17,-152.09,391.46,0,0,0,0]
[null,"Qatar / Nahrwan Maersk","Clarke 1880 Mod",-250.2,-153.09,391.7,0,0,0,0]
[null,"Qatar / Qatar National","International",-128.16,-282.42,21.93,0,0,0,0]
[null,"Royaume Uni / DOPPLER","Precise"]
[null,"Royaume Uni / ED50","International",-86,-96,-120,0,0,0,0]
[null,"Royaume Uni / OS(SN)80","Airy",364.71,-109.42,429,0,0,-0.156,1.198]
[null,"Russie / Pulkovo","Krassovsky"]
[null,"Russie / WGS72","WGS72"]
[null,"Sabah / Timbalai 1948","Everest 1830",-689,691,-46,0,0,0,0]
[null,"San Salvador / NAD27","Clarke 1866",1,140,165,0,0,0,0]
[null,"Sarawak / Timbalai 1948","Everst 1830",-689,691,-46,0,0,0,0]
[null,"Senegal / Adindan","Clarke 1880 Mod",-128,-18,224,0,0,0,0]
[null,"Singapour / Kertau 1948","Everest 1830",8.2100000000000009,861.39,1.31,0,0,0.81399999999999995,-0.38]
[null,"Singapour / Kertau 1948","Everest Mod",-11,851,5,0,0,0,0]
[null,"Singapour / South Asia","Fisher Mod",7,-10,-26,0,0,0,0]
[null,"Somalie / Afgooye","Krassovsky",-43,-163,45,0,0,0,0]
[null,"Soudan / Adindan","Clarke 1880 Mod",-161,-14,205,0,0,0,0]
[null,"Sri Lanka / Kandawala","Everest 1830",-97,787,86,0,0,0,0]
[null,"Sumatra / Djakarta (Batavia)","Bessel 1841",-377,681,-50,0,0,0,0]
[null,"Surinam / Zanderij","International",-265,120,-358,0,0,0,0]
[null,"Swaziland / Cape Arc 1950","Clarke 1880",-134,-105,-295,0,0,0,0]
[null,"Tanzanie / Cape Arc 1960","Clarke 1880",-158,-12,-299,0,0,0,0]
[null,"Tasmanie / Australian National","RE 1967",-134,-48,149,0,0,0,0]
[null,"Thailande / Indian","Everest 1830",214,836,303,0,0,0,0]
[null,"Thailande / Moattama","WGS84",-4.6900000000000004,8.5,2.89,0,0,0,0]
[null,"Tunisie / Carthage","Clarke 1880 Mod",-263,6,431,0,0,0,0]
[null,"Turquie / NAD27","Clarke 1866",-7,152,178,0,0,0,0]
[null,"USA / NAD27 (CONUS)","Clarke 1866",-22,157,180.5,0,0,0.55400000000000005,0.22700000000000001]
[null,"Venezuela / Prov. S. American 1956","International",-288,175,-376,0,0,0,0]
[null,"Venezuela / S. American 1969","S. American 1969",-57,1,-41,0,0,0,0]
[null,"Vietnam / Indian","Everest 1830",289,734,257,0,0,0,0]
[null,"Zaire / Cape Arc 1950","Clarke 1880",-169,-19,-278,0,0,0,0]
[null,"Zambie / Cape Arc 1950","Clarke 1880",-147,-74,-283,0,0,0,0]

{"sheet":"Projections","index":9,"n_rows":51,"n_cols":11,"rows_kept":51,"cut":false,"hidden":true,"merged":[[20,5,20,9]]}
["Parametres de Projection"]
[]
[]
[]
[]
[]
[null,null,"Nom","Ro","Meridien Central","E/W","Lat. Origin","N/S","Facteur d'échelle","Easting d'origine","Northing d'origine"]
[null,1,"UTM N",null,null,"E",null,"N",0.99960000000000004,500000,0]
[null,2,"UTM S",null,null,"W",null,"S",0.99960000000000004,500000,1000000]
[null,3,"Inactive"]
[null,4,"Lambert 1",5457616.6799999997,2.3372291666666669,"E",49.5,"N",0.99987734100000003,600000,1200000]
[null,5,"Lambert 2",5999695.7699999996,2.3372291666666669,"E",46.8,"N",0.99987742000000002,600000,2200000]
[null,6,"Lambert 3",6591905.0800000001,2.3372291666666669,"E",44.1,"N",0.999877499,600000,3200000]
[null,7,"Lambert 4",7053300.1799999997,2.3372291666666669,"E",42.164999999999999,"N",0.99994470999999996,234.358,185861.36900000001]
[null,8,"Lamb. 2 Etendu",null,2.3372291666666669,"E",46.8,"N",0.99987742000000002,600000,2200000]
[null,9,"Lambert 93",null,3,"E",46.5,"N",0.99903839999999999,700000,6600000]
[null,10,"Inactive"]
[]
[]
[]
[null,null,null,null,null,"Paramètres de projections utilisées en France métropolitaine"," "," "," "," "]
[null,null,"Projection","Type","Système","Ellipsoïde","FalseEasting","FalseNorthing","Longitude","Latitude","Facteur"]
[null,null," "," ","géodésique"," ","Eo","No","à l'origine","à l'origine","D'échelle"]
[null,null,"CC42","cc","RGF93","WGS84",1700000,1200000,2.5,42,1]
[null,null,"CC43","cc","RGF93","WGS84",1700000,2200000,2.5,43,1]
[null,null,"CC44","cc","RGF93","WGS84",1700000,3200000,2.5,44,1]
[null,null,"CC45","cc","RGF93","WGS84",1700000,4200000,2.5,45,1]
[null,null,"CC46","cc","RGF93","WGS84",1700000,5200000,2.5,46,1]
[null,null,"CC47","cc","RGF93","WGS84",1700000,6200000,2.5,47,1]
[null,null,"CC48","cc","RGF93","WGS84",1700000,7200000,2.5,48,1]
[null,null,"CC49","cc","RGF93","WGS84",1700000,8200000,2.5,49,1]
[null,null,"CC50","cc","RGF93","WGS84",1700000,9200000,2.5,50,1]
[null,null,"Lambert 93","cc","RGF93","WGS84",700000,6600000,3,46.5,0.99905103006399998]
[null,null,"Lambert I","cc","France IGN / NTF","Clarke 1880 IGN",600000,200000,2.3372291700000001,49.5,0.99987734100000003]
[null,null,"Lambert II","cc","France IGN / NTF","Clarke 1880 IGN",600000,200000,2.3372291700000001,46.8,0.99987742000000002]
[null,null,"Lambert II étendu","cc","France IGN / NTF","Clarke 1880 IGN",600000,2200000,2.3372291700000001,46.8,0.999877499]
[null,null,"Lambert III","cc","France IGN / NTF","Clarke 1880 IGN",600000,200000,2.3372291700000001,44.1,0.99994470999999996]
[null,null,"Lambert IV","cc","France IGN / NTF","Clarke 1880 IGN",234.358,185861.36900000001,2.3372291700000001,42.164999999999999,0.99987742000000002]
[null,null,"Lambert 1 Carto","cc","France IGN / NTF","Clarke 1880 IGN",600000,1200000,2.3372291700000001,49.5,0.99987734100000003]
[null,null,"Lambert 2 Carto","cc","France IGN / NTF","Clarke 1880 IGN",600000,2200000,2.3372291700000001,46.8,0.99987742000000002]
[null,null,"Lambert 3 Carto","cc","France IGN / NTF","Clarke 1880 IGN",600000,3200000,2.3372291700000001,44.1,0.999877499]
[null,null,"Lambert 4 Carto","cc","France IGN / NTF","Clarke 1880 IGN",234.358,4185861.3689999999,2.3372291700000001,42.164999999999999,0.99994470999999996]
[null,null,"UTM 30 Nord","TM","WGS84","WGS84",500000,"O",-3,0,0.99987742000000002]
[null,null,"UTM 31 Nord","TM","WGS84","WGS84",500000,"O",3,0,0.99987734100000003]
[null,null,"UTM 32 Nord","TM","WGS84","WGS84",500000,"O",9,0,0.99987742000000002]
[null,null,"UTM 30 Nord","TM","ED50","International",500000,"O",-3,0,0.999877499]
[null,null,"UTM 31 Nord","TM","ED50","International",500000,"O",3,0,0.99994470999999996]
[null,null,"UTM 32 Nord","TM","ED50","International",500000,"O",9,0,0.99987742000000002]
[]
[null,null,null,null,100,46.85]
[null,null,null,null,90,{"$f":"F50*E51/E50","v":42.164999999999999}]

{"sheet":"Parametres Proj","index":10,"n_rows":183,"n_cols":11,"rows_kept":183,"cut":false,"hidden":true,"merged":[]}
["Ajouter les nouvelles data en fin de colonnes",null,null,null,"Ne pas editer cette feuille"]
["Meridien Central en degres","Latitude d'origine","Eastings d'origines","Nothings d'origines","Facteur d'echelle au M C",null,"CM/SP","Lat/Lon Orig","CM SF","FE","FN"]
[3,0,0,-100000,0.99903839999999999,0,69,39,97,97,97]
[9,1,234.358,0,0.99960000000000004,1,35,65,7,7,7]
[15,2,200000,185861.36900000001,0.99960126999999999,2,null,53.5]
[21,3,400000,200000,0.99987734100000003,3]
[27,4,500000,250000,0.99987742000000002,4]
[45,7,600000,1200000,0.99987742999999996,7]
[51,8,700000,2200000,0.999877499,8]
[57,9,null,3200000,1.000035,9]
[63,10,null,6600000,1,10]
[69,11,null,10000000,null,11]
[75,12,null,20000000,null,12]
[81,13,null,3916482.2080000001,null,13]
[87,14,null,null,null,14]
[93,15,null,null,null,15]
[103,16,null,null,null,16]
[109,17,null,null,null,17]
[115,18,null,null,null,18]
[121,19,null,null,null,19]
[127,20,null,null,null,20]
[133,21,null,null,null,21]
[139,22,null,null,null,22]
[145,23,null,null,null,23]
[151,24,null,null,null,24]
[157,25,null,null,null,25]
[163,26,null,null,null,26]
[169,27,null,null,null,27]
[175,28,null,null,null,28]
[8,29,null,null,null,29]
[2.3372291666666669,30,null,null,null,30]
[null,31,null,null,null,31]
[null,32,null,null,null,32]
[null,33,null,null,null,33]
[null,34,null,null,null,34]
[null,35,null,null,null,35]
[null,36,null,null,null,36]
[null,37,null,null,null,37]
[null,38,null,null,null,38]
[null,39,null,null,null,39]
[null,40,null,null,null,40]
[null,41,null,null,null,41]
[null,42,null,null,null,42]
[null,43,null,null,null,43]
[null,44,null,null,null,44]
[null,45,null,null,null,45]
[null,46,null,null,null,46]
[null,47,null,null,null,47]
[null,48,null,null,null,48]
[null,49,null,null,null,49]
[null,50,null,null,null,50]
[null,51,null,null,null,51]
[null,52,null,null,null,52]
[null,53,null,null,null,53]
[null,54,null,null,null,54]
[null,55,null,null,null,55]
[null,56,null,null,null,56]
[null,57,null,null,null,57]
[null,58,null,null,null,58]
[null,59,null,null,null,59]
[null,60,null,null,null,60]
[null,61,null,null,null,61]
[null,49.5,null,null,null,62]
[null,46.8,null,null,null,63]
[null,44.1,null,null,null,64]
[null,42.164999999999999,null,null,null,65]
[null,null,null,null,null,66]
[null,null,null,null,null,67]
[null,null,null,null,null,68]
[null,null,null,null,null,69]
[null,null,null,null,null,70]
[null,null,null,null,null,71]
[null,null,null,null,null,72]
[null,null,null,null,null,73]
[null,null,null,null,null,74]
[null,null,null,null,null,75]
[null,null,null,null,null,76]
[null,null,null,null,null,77]
[null,null,null,null,null,78]
[null,null,null,null,null,79]
[null,null,null,null,null,80]
[null,null,null,null,null,81]
[null,null,null,null,null,82]
[null,null,null,null,null,83]
[null,null,null,null,null,84]
[null,null,null,null,null,85]
[null,null,null,null,null,86]
[null,null,null,null,null,87]
[null,null,null,null,null,88]
[null,null,null,null,null,89]
[null,null,null,null,null,90]
[null,null,null,null,null,91]
[null,null,null,null,null,92]
[null,null,null,null,null,93]
[null,null,null,null,null,94]
[null,null,null,null,null,95]
[null,null,null,null,null,96]
[null,null,null,null,null,97]
[null,null,null,null,null,98]
[null,null,null,null,null,99]
[null,null,null,null,null,100]
[null,null,null,null,null,101]
[null,null,null,null,null,102]
[null,null,null,null,null,103]
[null,null,null,null,null,104]
[null,null,null,null,null,105]
[null,null,null,null,null,106]
[null,null,null,null,null,107]
[null,null,null,null,null,108]
[null,null,null,null,null,109]
[null,null,null,null,null,110]
[null,null,null,null,null,111]
[null,null,null,null,null,112]
[null,null,null,null,null,113]
[null,null,null,null,null,114]
[null,null,null,null,null,115]
[null,null,null,null,null,116]
[null,null,null,null,null,117]
[null,null,null,null,null,118]
[null,null,null,null,null,119]
[null,null,null,null,null,120]
[null,null,null,null,null,121]
[null,null,null,null,null,122]
[null,null,null,null,null,123]
[null,null,null,null,null,124]
[null,null,null,null,null,125]
[null,null,null,null,null,126]
[null,null,null,null,null,127]
[null,null,null,null,null,128]
[null,null,null,null,null,129]
[null,null,null,null,null,130]
[null,null,null,null,null,131]
[null,null,null,null,null,132]
[null,null,null,null,null,133]
[null,null,null,null,null,134]
[null,null,null,null,null,135]
[null,null,null,null,null,136]
[null,null,null,null,null,137]
[null,null,null,null,null,138]
[null,null,null,null,null,139]
[null,null,null,null,null,140]
[null,null,null,null,null,141]
[null,null,null,null,null,142]
[null,null,null,null,null,143]
[null,null,null,null,null,144]
[null,null,null,null,null,145]
[null,null,null,null,null,146]
[null,null,null,null,null,147]
[null,null,null,null,null,148]
[null,null,null,null,null,149]
[null,null,null,null,null,150]
[null,null,null,null,null,151]
[null,null,null,null,null,152]
[null,null,null,null,null,153]
[null,null,null,null,null,154]
[null,null,null,null,null,155]
[null,null,null,null,null,156]
[null,null,null,null,null,157]
[null,null,null,null,null,158]
[null,null,null,null,null,159]
[null,null,null,null,null,160]
[null,null,null,null,null,161]
[null,null,null,null,null,162]
[null,null,null,null,null,163]
[null,null,null,null,null,164]
[null,null,null,null,null,165]
[null,null,null,null,null,166]
[null,null,null,null,null,167]
[null,null,null,null,null,168]
[null,null,null,null,null,169]
[null,null,null,null,null,170]
[null,null,null,null,null,171]
[null,null,null,null,null,172]
[null,null,null,null,null,173]
[null,null,null,null,null,174]
[null,null,null,null,null,175]
[null,null,null,null,null,176]
[null,null,null,null,null,177]
[null,null,null,null,null,178]
[null,null,null,null,null,179]
[null,null,null,null,null,180]
[null,null,null,null,null,181]
[null,null,null,null,null,182]