{"text_format":"1","workbook":"xlsx","n_sheets":11,"sheets":["Choix","Geodesies","Geographique","UTM","Mercator","Lambert","Cartesiens","Spheroides","Table Datum Shifts","Projections","Parametres Proj"],"not_rendered":{"charts":0,"images":0,"macros":1,"external_links":0,"defined_names":0,"comments":0,"pivot_tables":0},"unopened":[],"bounds":{"document_bytes":16777216,"sheet_cells":100000,"rows_first":2000,"rows_last":500,"rows_between":2000,"halvings":0,"cell_chars":16384,"cell_head_chars":4096},"cells_cut":0,"cells_raw":0,"read":"whole","date_system":"1900"}

{"sheet":"Choix","index":0,"n_rows":34,"n_cols":6,"rows_kept":34,"cut":false,"hidden":false,"merged":[[30,1,30,2],[1,1,1,2],[2,1,2,2],[3,1,3,2],[7,1,7,2],[17,1,17,2],[30,4,30,5],[1,4,1,5],[2,4,2,5],[3,4,3,5],[7,4,7,5],[17,4,17,5]]}
[]
[null,"Géodésie 1",null,null,"Géodésie 2"]
[]
[null,"Sphéroide",null,null,"Sphéroide"]
[null,"Région & Datum",null,null,"Région & Datum"]
[null,"Sphéroide"]
[]
[null,"Paramètres UTM",null,null,"Paramètres UTM"]
[null,"Projection",null,null,"Projection"]
[null,"Méridien central",null,null,"Méridien central"]
{"$rows_left_out":25}
{"sheet":"Geodesies","index":1,"n_rows":45,"n_cols":16,"rows_kept":45,"cut":false,"hidden":true,"merged":[[2,3,2,4],[10,3,10,4],[34,3,34,4],[21,3,21,4],[2,12,2,13],[10,12,10,13],[34,12,34,13],[21,12,21,13],[2,7,2,8]]}
[]
[]
[null,null,null,"Sphéroide 1",null,null,null,"Datum Shifts de 1 vers 2",null,null,null,null,"Sphéroide 2"]
[null,null,44,"Région & Datum:",{"$f":"(INDEX('Table Datum Shifts'!$B$3:$B$185,C4))","v":"France / IGN/NTF"},null,{"$f":"INDEX('Table Datum Shifts'!$D$3:$D$199,C4)","v":-168},"Dx",{"$f":"G4-J4","v":0},{"$f":"INDEX('Table Datum Shifts'!$D$3:$D$199,L4)","v":-168},null,44,"Région & Datum:",{"$f":"(INDEX('Table Datum Shifts'!$B$3:$B$185,L4))","v":"France / IGN/NTF"}]
[null,null,12,"Sphéroïde:",{"$f":"INDEX(Spheroides!$C$8:$C$56,C5)","v":"CLARKE 1880 IGN"},null,{"$f":"INDEX('Table Datum Shifts'!$E$3:$E$199,C4)","v":-60},"Dy",{"$f":"G5-J5","v":0},{"$f":"INDEX('Table Datum Shifts'!$E$3:$E$199,L4)","v":-60},null,12,"Sphéroïde:",{"$f":"INDEX(Spheroides!$C$8:$C$56,L5)","v":"CLARKE 1880 IGN"}]
[null,null,null,"Gd Axe:",{"$f":"INDEX(Spheroides!$D$8:$D$56,C5)","v":6378249.2000000002},null,{"$f":"INDEX('Table Datum Shifts'!$F$3:$F$199,C4)","v":320},"Dz",0,{"$f":"INDEX('Table Datum Shifts'!$F$3:$F$199,L4)","v":320},null,null,"Gd Axe:",{"$f":"INDEX(Spheroides!$D$8:$D$56,L5)","v":6378249.2000000002}]
[null,null,null,"Pt Axe:",{"$f":"INDEX(Spheroides!$E$8:$E$56,C5)","v":6356515},null,{"$f":"INDEX('Table Datum Shifts'!$G$3:$G$199,C4)","v":0},"Rx",0,{"$f":"INDEX('Table Datum Shifts'!$G$3:$G$199,L4)","v":0},null,null,"Pt Axe:",{"$f":"INDEX(Spheroides!$E$8:$E$56,L5)","v":6356515}]
[null,null,null,"e2",{"$f":"INDEX(Spheroides!$F$8:$F$56,C5)","v":6.8034876462998934E-3},null,{"$f":"INDEX('Table Datum Shifts'!$H$3:$H$199,C4)","v":0},"Ry",0,{"$f":"INDEX('Table Datum Shifts'!$H$3:$H$199,L4)","v":0},null,null,"e2",{"$f":"INDEX(Spheroides!$F$8:$F$56,L5)","v":6.8034876462998934E-3}]
[null,null,null,"1 / f",{"$f":"INDEX(Spheroides!$H$8:$H$56,C5)","v":293.46602129362691},null,{"$f":"INDEX('Table Datum Shifts'!$I$3:$I$199,C4)","v":0},"Rz",0,{"$f":"INDEX('Table Datum Shifts'!$I$3:$I$199,L4)","v":0},null,null,"1 / f",{"$f":"INDEX(Spheroides!$H$8:$H$56,L5)","v":293.46602129362691}]
[null,null,null,null,null,null,{"$f":"INDEX('Table Datum Shifts'!$J$3:$J$199,C4)","v":-54.74},"ppm",0,{"$f":"INDEX('Table Datum Shifts'!$J$3:$J$199,L4)","v":-54.74}]
{"$rows_left_out":36}
{"sheet":"Geographique","index":2,"n_rows":28,"n_cols":20,"rows_kept":28,"cut":false,"hidden":false,"merged":[[3,1,3,3],[3,4,3,9],[3,11,3,13],[3,14,3,19],[0,0,0,20],[2,1,2,3],[2,4,2,9],[2,11,2,13],[2,14,2,19],[5,1,5,9],[5,11,5,19],[6,1,6,4],[6,5,6,8],[6,11,6,14],[6,15,6,18],[11,1,11,8],[11,11,11,18],[12,1,12,4],[12,5,12,8],[12,11,12,14],[12,15,12,18],[13,1,13,4],[13,5,13,8],[13,11,13,14],[13,15,13,18],[14,1,14,4],[14,5,14,8],[14,11,14,14],[14,15,14,18],[15,5,15,8],[15,15,15,18],[17,1,17,8],[17,11,17,18],[18,1,18,4],[18,5,18,8],[18,11,18,14],[18,15,18,18],[19,1,19,4],[19,5,19,8],[19,11,19,14],[19,15,19,18],[21,1,21,8],[21,11,21,18],[22,11,22,14],[22,15,22,18],[23,1,23,4],[23,5,23,8],[23,11,23,14],[23,15,23,18],[8,2,8,4],[8,6,8,8],[8,12,8,14],[8,16,8,18],[27,1,27,4],[27,5,27,8],[27,11,27,14],[27,15,27,18],[25,1,25,9],[25,11,25,19],[26,1,26,4],[26,5,26,8],[26,11,26,14],[26,15,26,18],[22,1,22,4],[22,5,22,8]]}
["Conversion de geographiques"]
[]
[null,"Géodésie 1",null,null,{"$f":"Geodesies!E4","v":"France / IGN/NTF"},null,null,null,null,null,null,"Géodésie 2",null,null,{"$f":"Geodesies!N4","v":"France / IGN/NTF"}]
[null,"Sphéroïde",null,null,{"$f":"Geodesies!E5","v":"CLARKE 1880 IGN"},null,null,null,null,null,null,"Sphéroïde",null,null,{"$f":"Geodesies!N5","v":"CLARKE 1880 IGN"}]
[null,null,null,null,null,null,null,null,null,null,null,{"$f":"CaGeLat2(L28,P28,T28)","v":43.164999999999999},{"$f":"CaGeLon2(L28,P28)","v":2.3372291666666674},{"$f":"(ABS(L5)-ABS(L8))*60","v":9.8999999999999488},null,null,null,{"$f":"(ABS(M5)-ABS(P8))*60","v":20.233750000000043}]
[null,{"$f":"Geodesies!E4","v":"France / IGN/NTF"},null,null,null,null,null,null,null,null,null,{"$f":"Geodesies!N4","v":"France / IGN/NTF"}]
[null,"Latitude",null,null,null,"Longitude",null,null,null,"Elévation",null,"Latitude",null,null,null,"Longitude",null,null,null,"Elévation"]
[null,43,9,54,{"$f":"IF(B8+C8/60+D8/3600>0,\"N\",\"S\")","v":"N"},2,20,14.025,{"$f":"IF(F8+G8/60+H8/3600>0,\"E\",\"W\")","v":"E"},300,null,{"$f":"TRUNC(L5,0)","v":43},{"$f":"TRUNC((ABS(L5)-ABS(L8))*60)","v":9},{"$f":"(N5-M8)*60","v":53.99999999999693},{"$f":"IF(L5<0,\"S\",\"N\")","v":"N"},{"$f":"TRUNC(M5,0)","v":2},{"$f":"TRUNC((ABS(M5)-ABS(P8))*60)","v":20},{"$f":"(R5-Q8)*60","v":14.025000000002592},{"$f":"IF(M5<0,\"W\",\"E\")","v":"E"},{"$f":"CaGeEle2(L28,P28,T28)","v":300}]
[null,{"$f":"B7","v":"Latitude"},"Latitude",null,null,{"$f":"F7","v":"Longitude"},"Longitude",null,null,null,null,{"$f":"L7","v":"Latitude"},"Latitude",null,null,{"$f":"P7","v":"Longitude"},"Longitude"]
[null,{"$f":"B8","v":43},{"$f":"B8","v":43},{"$f":"C8+D8/60","v":9.9},{"$f":"E8","v":"N"},{"$f":"F8","v":2},{"$f":"F8","v":2},{"$f":"G8+H8/60","v":20.233750000000001},{"$f":"I8","v":"E"},null,null,{"$f":"L8","v":43},{"$f":"TRUNC(L5,0)","v":43},{"$f":"ABS(L5-TRUNC(L5,0))*60","v":9.8999999999999488},{"$f":"IF(L5<0,\"S\",\"N\")","v":"N"},{"$f":"P8","v":2},{"$f":"TRUNC(M5,0)","v":2},{"$f":"ABS(M5-P8)*60","v":20.233750000000043},{"$f":"IF(M5<0,\"W\",\"E\")","v":"E"}]
{"$rows_left_out":19}
{"sheet":"UTM","index":3,"n_rows":28,"n_cols":20,"rows_kept":28,"cut":false,"hidden":false,"merged":[[3,1,3,3],[3,4,3,9],[3,11,3,13],[3,14,3,19],[0,0,0,20],[2,1,2,3],[2,4,2,9],[2,11,2,13],[2,14,2,19],[5,1,5,9],[5,11,5,19],[6,1,6,3],[6,4,6,8],[6,11,6,14],[6,15,6,18],[13,1,13,4],[13,5,13,8],[13,11,13,14],[13,15,13,18],[14,1,14,4],[14,5,14,8],[14,11,14,14],[14,15,14,18],[11,1,11,8],[11,11,11,18],[12,1,12,4],[12,5,12,8],[12,11,12,14],[12,15,12,18],[18,1,18,4],[18,5,18,8],[18,11,18,14],[18,15,18,18],[15,5,15,8],[15,15,15,18],[17,1,17,8],[17,11,17,18],[21,1,21,8],[19,1,19,4],[19,5,19,8],[19,11,19,14],[19,15,19,18],[23,11,23,14],[23,15,23,18],[22,1,22,4],[22,5,22,8],[22,11,22,14],[22,15,22,18],[8,16,8,18],[8,2,8,4],[8,6,8,8],[8,12,8,14],[27,1,27,4],[27,5,27,8],[27,11,27,14],[27,15,27,18],[25,1,25,9],[25,11,25,19],[26,1,26,4],[26,5,26,8],[26,11,26,14],[26,15,26,18],[23,1,23,4],[23,5,23,8]]}
["Conversion d'UTM"]
[]
[null,"Géodésie 1",null,null,{"$f":"Geodesies!E4","v":"France / IGN/NTF"},null,null,null,null,null,null,"Géodésie 2",null,null,{"$f":"Geodesies!N4","v":"France / IGN/NTF"}]
[null,"Sphéroïde",null,null,{"$f":"Geodesies!E5","v":"CLARKE 1880 IGN"},null,null,null,null,null,null,"Sphéroïde",null,null,{"$f":"Geodesies!N5","v":"CLARKE 1880 IGN"}]
[null,{"$f":"UtGeLat(B14,F14)","v":45.934136203863694},{"$f":"UtGeLon(B14,F14)","v":-2.9996773533086212},{"$f":"(ABS(B5)-ABS(B8))*60","v":56.048172231821667},null,null,null,{"$f":"(ABS(C5)-ABS(F8))*60","v":59.980641198517269},null,null,null,{"$f":"CaGeLat2(L28,P28,T28)","v":45.93413620386368},{"$f":"CaGeLon2(L28,P28)","v":-2.9996773533086203},{"$f":"(ABS(L5)-ABS(L8))*60","v":56.048172231820814},null,null,null,{"$f":"(ABS(M5)-ABS(P8))*60","v":59.980641198517219}]
[null,"Coordonnées Géographiques",null,null,null,null,null,null,null,null,null,"Coordonnées Géographiques"]
[null,"Latitude",null,null,"Longitude",null,null,null,null,"Elévation",null,"Latitude",null,null,null,"Longitude",null,null,null,"Elévation"]
[null,{"$f":"TRUNC(B5,0)","v":45},{"$f":"TRUNC((ABS(B5)-ABS(B8))*60)","v":56},{"$f":"(D5-C8)*60","v":2.8903339093000113},{"$f":"IF(B5<0,\"S\",\"N\")","v":"N"},{"$f":"TRUNC(C5,0)","v":-2},{"$f":"TRUNC((ABS(C5)-ABS(F8))*60)","v":59},{"$f":"(H5-G8)*60","v":58.838471911036123},{"$f":"IF(C5<0,\"W\",\"E\")","v":"W"},0,null,{"$f":"TRUNC(L5,0)","v":45},{"$f":"TRUNC((ABS(L5)-ABS(L8))*60)","v":56},{"$f":"(N5-M8)*60","v":2.8903339092488523},{"$f":"IF(L5<0,\"S\",\"N\")","v":"N"},{"$f":"TRUNC(M5,0)","v":-2},{"$f":"TRUNC((ABS(M5)-ABS(P8))*60)","v":59},{"$f":"(R5-Q8)*60","v":58.838471911033139},{"$f":"IF(M5<0,\"W\",\"E\")","v":"W"},{"$f":"CaGeEle2(L28,P28,T28)","v":9.3132257461547852E-10}]
[null,{"$f":"B7","v":"Latitude"},"Latitude",null,null,{"$f":"F7","v":0},"Longitude",null,null,null,null,{"$f":"L7","v":"Latitude"},"Latitude",null,null,{"$f":"P7","v":"Longitude"},"Longitude"]
[null,{"$f":"B8","v":45},{"$f":"TRUNC(B5,0)","v":45},{"$f":"ABS(B5-TRUNC(B5,0))*60","v":56.048172231821667},{"$f":"IF(B5<0,\"S\",\"N\")","v":"N"},{"$f":"F8","v":-2},{"$f":"TRUNC(C5,0)","v":-2},{"$f":"ABS(C5-F8)*60","v":59.980641198517269},{"$f":"IF(C5<0,\"W\",\"E\")","v":"W"},null,null,{"$f":"L8","v":45},{"$f":"TRUNC(L5,0)","v":45},{"$f":"ABS(L5-TRUNC(L5,0))*60","v":56.048172231820814},{"$f":"IF(L5<0,\"S\",\"N\")","v":"N"},{"$f":"P8","v":-2},{"$f":"TRUNC(M5,0)","v":-2},{"$f":"ABS(M5-P8)*60","v":59.980641198517219},{"$f":"IF(M5<0,\"W\",\"E\")","v":"W"}]
{"$rows_left_out":19}
{"sheet":"Mercator","index":4,"n_rows":28,"n_cols":20,"rows_kept":28,"cut":false,"hidden":false,"merged":[[3,1,3,3],[3,4,3,9],[3,11,3,13],[3,14,3,19],[0,0,0,20],[2,1,2,3],[2,4,2,9],[2,11,2,13],[2,14,2,19],[5,1,5,9],[5,11,5,19],[6,1,6,4],[6,5,6,8],[6,11,6,14],[6,15,6,18],[11,1,11,8],[11,11,11,18],[12,1,12,4],[12,5,12,8],[12,11,12,14],[12,15,12,18],[13,1,13,4],[13,5,13,8],[13,11,13,14],[13,15,13,18],[14,1,14,4],[14,5,14,8],[14,11,14,14],[14,15,14,18],[15,5,15,8],[15,15,15,18],[17,1,17,8],[17,11,17,18],[18,1,18,4],[18,5,18,8],[18,11,18,14],[18,15,18,18],[19,1,19,4],[19,5,19,8],[19,11,19,14],[19,15,19,18],[21,1,21,8],[21,11,21,18],[22,11,22,14],[22,15,22,18],[23,1,23,4],[23,5,23,8],[23,11,23,14],[23,15,23,18],[8,2,8,4],[8,6,8,8],[8,12,8,14],[8,16,8,18],[27,1,27,4],[27,5,27,8],[27,11,27,14],[27,15,27,18],[25,1,25,9],[25,11,25,19],[26,1,26,4],[26,5,26,8],[26,11,26,14],[26,15,26,18],[22,1,22,4],[22,5,22,8]]}
["Conversion de Mercators"]
[]
[null,"Géodésie 1",null,null,{"$f":"Geodesies!E4","v":"France / IGN/NTF"},null,null,null,null,null,null,"Géodésie 2",null,null,{"$f":"Geodesies!N4","v":"France / IGN/NTF"}]
[null,"Sphéroïde",null,null,{"$f":"Geodesies!E5","v":"CLARKE 1880 IGN"},null,null,null,null,null,null,"Sphéroïde",null,null,{"$f":"Geodesies!N5","v":"CLARKE 1880 IGN"}]
[null,{"$f":"MeGeLat(F20)","v":41.108073297857594},{"$f":"MeGeLon(B20)","v":2.6948041273293728},{"$f":"(ABS(B5)-ABS(B8))*60","v":6.4843978714556272},null,null,null,{"$f":"(ABS(C5)-ABS(F8))*60","v":41.688247639762366},null,null,null,{"$f":"CaGeLat2(L28,P28,T28)","v":41.108073297857594},{"$f":"CaGeLon2(L28,P28)","v":2.6948041273293728},{"$f":"(ABS(L5)-ABS(L8))*60","v":6.4843978714556272},null,null,null,{"$f":"(ABS(M5)-ABS(P8))*60","v":41.688247639762366}]
[null,"Coordonnées Géographiques",null,null,null,null,null,null,null,null,null,"Coordonnées Géographiques"]
[null,"Latitude",null,null,null,"Longitude",null,null,null,"Elévation",null,"Latitude",null,null,null,"Longitude",null,null,null,"Elévation"]
[null,{"$f":"TRUNC(B5,0)","v":41},{"$f":"TRUNC((ABS(B5)-ABS(B8))*60)","v":6},{"$f":"(D5-C8)*60","v":29.063872287337631},{"$f":"IF(B5<0,\"S\",\"N\")","v":"N"},{"$f":"TRUNC(C5,0)","v":2},{"$f":"TRUNC((ABS(C5)-ABS(F8))*60)","v":41},{"$f":"(H5-G8)*60","v":41.294858385741975},{"$f":"IF(C5<0,\"W\",\"E\")","v":"E"},0,null,{"$f":"TRUNC(L5,0)","v":41},{"$f":"TRUNC((ABS(L5)-ABS(L8))*60)","v":6},{"$f":"(N5-M8)*60","v":29.063872287337631},{"$f":"IF(L5<0,\"S\",\"N\")","v":"N"},{"$f":"TRUNC(M5,0)","v":2},{"$f":"TRUNC((ABS(M5)-ABS(P8))*60)","v":41},{"$f":"(R5-Q8)*60","v":41.294858385741975},{"$f":"IF(M5<0,\"W\",\"E\")","v":"E"},{"$f":"CaGeEle2(L28,P28,T28)","v":-9.3132257461547852E-10}]
[null,{"$f":"B7","v":"Latitude"},"Latitude",null,null,{"$f":"F7","v":"Longitude"},"Longitude",null,null,null,null,{"$f":"L7","v":"Latitude"},"Latitude",null,null,{"$f":"P7","v":"Longitude"},"Longitude"]
[null,{"$f":"B8","v":41},{"$f":"TRUNC(B5,0)","v":41},{"$f":"ABS(B5-TRUNC(B5,0))*60","v":6.4843978714556272},{"$f":"IF(B5<0,\"S\",\"N\")","v":"N"},{"$f":"F8","v":2},{"$f":"TRUNC(C5,0)","v":2},{"$f":"ABS(C5-F8)*60","v":41.688247639762366},{"$f":"IF(C5<0,\"W\",\"E\")","v":"E"},null,null,{"$f":"L8","v":41},{"$f":"TRUNC(L5,0)","v":41},{"$f":"ABS(L5-TRUNC(L5,0))*60","v":6.4843978714556272},{"$f":"IF(L5<0,\"S\",\"N\")","v":"N"},{"$f":"P8","v":2},{"$f":"TRUNC(M5,0)","v":2},{"$f":"ABS(M5-P8)*60","v":41.688247639762366},{"$f":"IF(M5<0,\"W\",\"E\")","v":"E"}]
{"$rows_left_out":19}
{"sheet":"Lambert","index":5,"n_rows":28,"n_cols":20,"rows_kept":28,"cut":false,"hidden":false,"merged":[[3,1,3,3],[3,4,3,9],[3,11,3,13],[3,14,3,19],[0,0,0,20],[2,1,2,3],[2,4,2,9],[2,11,2,13],[2,14,2,19],[5,1,5,9],[5,11,5,19],[6,1,6,4],[6,5,6,8],[6,11,6,14],[6,15,6,18],[11,1,11,8],[11,11,11,18],[12,1,12,4],[12,5,12,8],[12,11,12,14],[12,15,12,18],[13,1,13,4],[13,5,13,8],[13,11,13,14],[13,15,13,18],[14,1,14,4],[14,5,14,8],[14,11,14,14],[14,15,14,18],[15,5,15,8],[15,15,15,18],[17,1,17,8],[17,11,17,18],[18,1,18,4],[18,5,18,8],[18,11,18,14],[18,15,18,18],[19,1,19,4],[19,5,19,8],[19,11,19,14],[19,15,19,18],[21,1,21,8],[21,11,21,18],[22,11,22,14],[22,15,22,18],[23,1,23,4],[23,5,23,8],[23,11,23,14],[23,15,23,18],[8,2,8,4],[8,6,8,8],[8,12,8,14],[8,16,8,18],[27,1,27,4],[27,5,27,8],[27,11,27,14],[27,15,27,18],[25,1,25,9],[25,11,25,19],[26,1,26,4],[26,5,26,8],[26,11,26,14],[26,15,26,18],[22,1,22,4],[22,5,22,8]]}
["Conversion de Lamberts"]
[]
[null,"Géodésie 1",null,null,{"$f":"Geodesies!E4","v":"France / IGN/NTF"},null,null,null,null,null,null,"Géodésie 2",null,null,{"$f":"Geodesies!N4","v":"France / IGN/NTF"}]
[null,"Sphéroïde",null,null,{"$f":"Geodesies!E5","v":"CLARKE 1880 IGN"},null,null,null,null,null,null,"Sphéroïde",null,null,{"$f":"Geodesies!N5","v":"CLARKE 1880 IGN"}]
[null,{"$f":"LaGeLat(B24,F24)","v":42.164999990113117},{"$f":"LaGeLon(B24,F24)","v":2.3372291700000001},{"$f":"(ABS(B5)-ABS(B8))*60","v":9.8999994067870034},null,null,null,{"$f":"(ABS(C5)-ABS(F8))*60","v":20.233750200000003},null,null,null,{"$f":"CaGeLat2(L28,P28,T28)","v":42.164999990113117},{"$f":"CaGeLon2(L28,P28)","v":2.3372291700000005},{"$f":"(ABS(L5)-ABS(L8))*60","v":9.8999994067870034},null,null,null,{"$f":"(ABS(M5)-ABS(P8))*60","v":20.233750200000031}]
[null,"Coordonnées Géographiques",null,null,null,null,null,null,null,null,null,"Coordonnées Géographiques"]
[null,"Latitude",null,null,null,"Longitude",null,null,null,"Elévation",null,"Latitude",null,null,null,"Longitude",null,null,null,"Elévation"]
[null,{"$f":"TRUNC(B5,0)","v":42},{"$f":"TRUNC((ABS(B5)-ABS(B8))*60)","v":9},{"$f":"(D5-C8)*60","v":53.999964407220205},{"$f":"IF(B5<0,\"S\",\"N\")","v":"N"},{"$f":"TRUNC(C5,0)","v":2},{"$f":"TRUNC((ABS(C5)-ABS(F8))*60)","v":20},{"$f":"(H5-G8)*60","v":14.025012000000174},{"$f":"IF(C5<0,\"W\",\"E\")","v":"E"},100,null,{"$f":"TRUNC(L5,0)","v":42},{"$f":"TRUNC((ABS(L5)-ABS(L8))*60)","v":9},{"$f":"(N5-M8)*60","v":53.999964407220205},{"$f":"IF(L5<0,\"S\",\"N\")","v":"N"},{"$f":"TRUNC(M5,0)","v":2},{"$f":"TRUNC((ABS(M5)-ABS(P8))*60)","v":20},{"$f":"(R5-Q8)*60","v":14.02501200000188},{"$f":"IF(M5<0,\"W\",\"E\")","v":"E"},{"$f":"CaGeEle2(L28,P28,T28)","v":100.00000000093132}]
[null,{"$f":"B7","v":"Latitude"},"Latitude",null,null,{"$f":"F7","v":"Longitude"},"Longitude",null,null,null,null,{"$f":"L7","v":"Latitude"},"Latitude",null,null,{"$f":"P7","v":"Longitude"},"Longitude"]
[null,{"$f":"B8","v":42},{"$f":"TRUNC(B5,0)","v":42},{"$f":"ABS(B5-TRUNC(B5,0))*60","v":9.8999994067870034},{"$f":"IF(B5<0,\"S\",\"N\")","v":"N"},{"$f":"F8","v":2},{"$f":"TRUNC(C5,0)","v":2},{"$f":"ABS(C5-F8)*60","v":20.233750200000003},{"$f":"IF(C5<0,\"W\",\"E\")","v":"E"},null,null,{"$f":"L8","v":42},{"$f":"TRUNC(L5,0)","v":42},{"$f":"ABS(L5-TRUNC(L5,0))*60","v":9.8999994067870034},{"$f":"IF(L5<0,\"S\",\"N\")","v":"N"},{"$f":"P8","v":2},{"$f":"TRUNC(M5,0)","v":2},{"$f":"ABS(M5-P8)*60","v":20.233750200000031},{"$f":"IF(M5<0,\"W\",\"E\")","v":"E"}]
{"$rows_left_out":19}
{"sheet":"Cartesiens","index":6,"n_rows":28,"n_cols":20,"rows_kept":28,"cut":false,"hidden":false,"merged":[[11,1,11,8],[11,11,11,18],[0,0,0,20],[2,1,2,3],[2,4,2,9],[2,11,2,13],[2,14,2,19],[3,1,3,3],[3,4,3,9],[3,11,3,13],[3,14,3,19],[5,1,5,9],[6,1,6,4],[6,5,6,8],[6,11,6,14],[6,15,6,18],[12,1,12,4],[12,5,12,8],[12,11,12,14],[12,15,12,18],[13,1,13,4],[13,5,13,8],[13,11,13,14],[13,15,13,18],[14,5,14,8],[14,15,14,18],[15,5,15,8],[15,15,15,18],[17,1,17,8],[17,11,17,18],[18,11,18,14],[18,15,18,18],[19,1,19,4],[19,5,19,8],[19,11,19,14],[19,15,19,18],[27,1,27,4],[27,5,27,8],[27,11,27,14],[27,15,27,18],[23,1,23,4],[23,5,23,8],[23,11,23,14],[23,15,23,18],[25,1,25,9],[25,11,25,19],[8,2,8,4],[8,6,8,8],[8,12,8,14],[8,16,8,18],[26,1,26,4],[26,5,26,8],[26,11,26,14],[26,15,26,18],[21,1,21,8],[21,11,21,18],[22,1,22,4],[22,5,22,8],[22,11,22,14],[22,15,22,18],[18,1,18,4],[18,5,18,8]]}
["Conversion de Cartésiens"]
[]
[null,"Géodésie 1",null,null,{"$f":"Geodesies!E4","v":"France / IGN/NTF"},null,null,null,null,null,null,"Géodésie 2",null,null,{"$f":"Geodesies!N4","v":"France / IGN/NTF"}]
[null,"Sphéroïde",null,null,{"$f":"Geodesies!E5","v":"CLARKE 1880 IGN"},null,null,null,null,null,null,"Sphéroïde",null,null,{"$f":"Geodesies!N5","v":"CLARKE 1880 IGN"}]
[null,{"$f":"CaGeLat1(B28,F28,J28)","v":48.600000000011683},{"$f":"CaGeLon1(B28,F28)","v":7.7372222222228499},{"$f":"(ABS(B5)-ABS(B8))*60","v":36.000000000700965},null,null,null,{"$f":"(ABS(C5)-ABS(F8))*60","v":44.233333333370993},null,null,null,{"$f":"CaGeLat2(L28,P28,T28)","v":48.600000000011683},{"$f":"CaGeLon2(L28,P28)","v":7.7372222222228499},{"$f":"(ABS(L5)-ABS(L8))*60","v":36.000000000700965},null,null,null,{"$f":"(ABS(M5)-ABS(P8))*60","v":44.233333333370993}]
[null,"Coordonnées Géographiques",null,null,null,null,null,null,null,null,null,"Coordonnées Géographiques"]
[null,"Latitude",null,null,null,"Longitude",null,null,null,"Elévation",null,"Latitude",null,null,null,"Longitude",null,null,null,"Elévation"]
[null,{"$f":"TRUNC(B5,0)","v":48},{"$f":"TRUNC((ABS(B5)-ABS(B8))*60)","v":36},{"$f":"(D5-C8)*60","v":4.2057877180923242E-8},{"$f":"IF(B5<0,\"S\",\"N\")","v":"N"},{"$f":"TRUNC(C5,0)","v":7},{"$f":"TRUNC((ABS(C5)-ABS(F8))*60)","v":44},{"$f":"(H5-G8)*60","v":14.000000002259583},{"$f":"IF(C5<0,\"W\",\"E\")","v":"E"},{"$f":"CaGeEle1(B28,F28,J28)","v":-9.6354633569717407E-6},null,{"$f":"TRUNC(L5,0)","v":48},{"$f":"TRUNC((ABS(L5)-ABS(L8))*60)","v":36},{"$f":"(N5-M8)*60","v":4.2057877180923242E-8},{"$f":"IF(L5<0,\"S\",\"N\")","v":"N"},{"$f":"TRUNC(M5,0)","v":7},{"$f":"TRUNC((ABS(M5)-ABS(P8))*60)","v":44},{"$f":"(R5-Q8)*60","v":14.000000002259583},{"$f":"IF(M5<0,\"W\",\"E\")","v":"E"},{"$f":"CaGeEle2(L28,P28,T28)","v":-9.6354633569717407E-6}]
[null,{"$f":"B7","v":"Latitude"},"Latitude",null,null,{"$f":"F7","v":"Longitude"},"Longitude",null,null,null,null,{"$f":"L7","v":"Latitude"},"Latitude",null,null,{"$f":"P7","v":"Longitude"},"Longitude"]
[null,{"$f":"B8","v":48},{"$f":"TRUNC(B5,0)","v":48},{"$f":"ABS(B5-TRUNC(B5,0))*60","v":36.000000000700965},{"$f":"IF(B5<0,\"S\",\"N\")","v":"N"},{"$f":"F8","v":7},{"$f":"TRUNC(C5,0)","v":7},{"$f":"ABS(C5-F8)*60","v":44.233333333370993},{"$f":"IF(C5<0,\"W\",\"E\")","v":"E"},null,null,{"$f":"L8","v":48},{"$f":"TRUNC(L5,0)","v":48},{"$f":"ABS(L5-TRUNC(L5,0))*60","v":36.000000000700965},{"$f":"IF(L5<0,\"S\",\"N\")","v":"N"},{"$f":"P8","v":7},{"$f":"TRUNC(M5,0)","v":7},{"$f":"ABS(M5-P8)*60","v":44.233333333370993},{"$f":"IF(M5<0,\"W\",\"E\")","v":"E"}]
{"$rows_left_out":19}
{"sheet":"Spheroides","index":7,"n_rows":56,"n_cols":8,"rows_kept":56,"cut":false,"hidden":true,"merged":[[0,0,0,8]]}
["Liste des Ellipsoides Disponibles"]
[]
[]
[]
[]
[]
[null,null,"Nom","Demi Grand","Demi Petit","e2","n","1 / f"]
[null,1,"AIRY",6377563.3959999997,6356256.909,{"$f":"POWER(1/D8*(SQRT((D8*D8)-(E8*E8))),2)","v":6.6705400741490836E-3},1.6732202503250534E-3,{"$f":"1/((D8-E8)/D8)","v":299.32496126649505}]
[null,2,"AIRY MOD",6377340.1890000002,6356034.4479999999,6.6705399807736503E-3,1.6732203054869081E-3,299.32496546352854]
[null,3,"AUSTRALIAN NATIONAL 1967/84",6378160,6356774.7189999996,6.694541915624532E-3,null,{"$f":"1/((D10-E10)/D10)","v":298.24999727615801}]
{"$rows_left_out":47}
{"sheet":"Table Datum Shifts","index":8,"n_rows":183,"n_cols":10,"rows_kept":183,"cut":false,"hidden":true,"merged":[]}
[6,null,181]
[180,"Zone / Datum","Spheroide","Dx","Dy","Dz","Rx","Ry","Rz","ppm"]
[null,"Afrique du Sud / S Africa Cape","Clarke 1880 Mod.",-136,-108,-292,0,0,0,0]
[null,"Alaska / NAD27","Clarke 1866",-12.62,156.56,180.52,0,0,0.81399999999999995,0.42699999999999999]
[null,"Alaska / NAD27","Clarke 1866",-5,135,172,0,0,0,0]
[null,"Alaska / NAD83","GRS80",0,0,0,0,0,0,0]
[null,"Amerique Central / NAD83","GRS80",0,0,0,0,0,0,0]
[null,"Arabie Saoudite / Nahrwan","Clarke 1880 Mod.",-231,-196,482,0,0,0,0]
[null,"Argentine / Campo Inchauste","International",-148,136,90,0,0,0,0]
[null,"Argentine / S. America 1969","S America 1969",-57,1,-41,0,0,0,0]
{"$rows_left_out":174}
{"sheet":"Projections","index":9,"n_rows":51,"n_cols":11,"rows_kept":51,"cut":false,"hidden":true,"merged":[[20,5,20,9]]}
["Parametres de Projection"]
[]
[]
[]
[]
[]
[null,null,"Nom","Ro","Meridien Central","E/W","Lat. Origin","N/S","Facteur d'échelle","Easting d'origine","Northing d'origine"]
[null,1,"UTM N",null,null,"E",null,"N",0.99960000000000004,500000,0]
[null,2,"UTM S",null,null,"W",null,"S",0.99960000000000004,500000,1000000]
[null,3,"Inactive"]
{"$rows_left_out":42}
{"sheet":"Parametres Proj","index":10,"n_rows":183,"n_cols":11,"rows_kept":183,"cut":false,"hidden":true,"merged":[]}
["Ajouter les nouvelles data en fin de colonnes",null,null,null,"Ne pas editer cette feuille"]
["Meridien Central en degres","Latitude d'origine","Eastings d'origines","Nothings d'origines","Facteur d'echelle au M C",null,"CM/SP","Lat/Lon Orig","CM SF","FE","FN"]
[3,0,0,-100000,0.99903839999999999,0,69,39,97,97,97]
[9,1,234.358,0,0.99960000000000004,1,35,65,7,7,7]
[15,2,200000,185861.36900000001,0.99960126999999999,2,null,53.5]
[21,3,400000,200000,0.99987734100000003,3]
[27,4,500000,250000,0.99987742000000002,4]
[45,7,600000,1200000,0.99987742999999996,7]
[51,8,700000,2200000,0.999877499,8]
[57,9,null,3200000,1.000035,9]
{"$rows_left_out":173}