{"text_format":"1","workbook":"xlsx","n_sheets":6,"sheets":["Geodesie","Modele","Dialog1","Spheroides","Caps et Distances","Couper_Inserer"],"not_rendered":{"charts":0,"images":0,"macros":1,"external_links":0,"defined_names":1,"comments":0,"pivot_tables":0},"unopened":[{"sheet":"Dialog1","index":2,"reason":"not_a_worksheet"},{"sheet":"Caps et Distances","index":4,"reason":"part_missing"},{"sheet":"Couper_Inserer","index":5,"reason":"part_missing"}],"bounds":{"document_bytes":16777216,"sheet_cells":100000,"rows_first":2000,"rows_last":500,"rows_between":2000,"halvings":0,"cell_chars":16384,"cell_head_chars":4096},"cells_cut":0,"cells_raw":0,"read":"whole","date_system":"1904"}

{"sheet":"Geodesie","index":0,"n_rows":9,"n_cols":5,"rows_kept":9,"cut":false,"hidden":false,"merged":[]}
["Paramètres de Base des Géodésies Utilisées"]
[]
["Index"]
[null,null,null,"Géodésie"]
["Spheroide:",12,null,"Sphéroide",{"$f":"INDEX(Spheroides!C8:C56,B5)","v":"CLARKE 1880 IGN"}]
[null,null,null,"Gd Axe:",{"$f":"INDEX(Spheroides!D8:D56,B5)","v":6378249.2000000002}]
[null,null,null,"Pt Axe:",{"$f":"INDEX(Spheroides!E8:E56,B5)","v":6356515}]
[null,null,null,"e2",{"$f":"INDEX(Spheroides!F8:F56,B5)","v":6.8034876462998934E-3}]
[null,null,null,"1 / f",{"$f":"INDEX(Spheroides!H8:H56,B5)","v":293.46602129362691}]

{"sheet":"Modele","index":1,"n_rows":37,"n_cols":20,"rows_kept":37,"cut":false,"hidden":false,"merged":[]}
["Version du 20/12/95","Position",{"$f":"Geodesie!E5","v":"CLARKE 1880 IGN"},null,null,null,null,null,null,"Distance (km)",null,"Slack","Cable Distance (km)",null,"Cable","Cumulative","Totals","Approx"]
["Christian Auroux","Number","Latitude",null,null,"Longitude",null,null,"Heading","Between","Cumulative","%","Between","Cumulative","Type","by type","By Type","Depth",null,"Comments"]
["rplcap",null,null,null,null,null,null,null,null,"Positions","Total",null,"Positions","Total",null,null,"(km)","(m)"]
[]
[null,1,41,14.2,{"$f":"IF(OR(C5<0,AND(C5=0,D5<0)),\"S\",\"N\")","v":"N"},9,57,{"$f":"IF(OR(F5<0,AND(F5=0,G5<0)),\"W\",\"E\")","v":"E"},null,null,0,null,null,0,null,0,{"$f":"IF(O4=O6,\"\",P5)","v":0},0,null,"Landing"]
[null,null,null,null,null,null,null,null,{"$f":"Cap(C5,D5,F5,G5,C7,D7,F7,G7)","v":356.64308176303848},{"$f":"Distance(C5,D5,F5,G5,C7,D7,F7,G7)","v":21.693836040618542},null,1,{"$f":"J6*(1+L6/100)","v":21.910774401024728},null,"DA"]
[null,{"$f":"B5+1","v":2},41,25.9,{"$f":"IF(OR(C7<0,AND(C7=0,D7<0)),\"S\",\"N\")","v":"N"},9,56.085999999999999,{"$f":"IF(OR(F7<0,AND(F7=0,G7<0)),\"W\",\"E\")","v":"E"},null,null,{"$f":"K5+J6","v":21.693836040618542},null,null,{"$f":"N5+M6","v":21.910774401024728},null,{"$f":"IF(O6=O4,P5+M6,M6)","v":21.910774401024728},{"$f":"IF(O6=O8,\"\",P7)","v":21.910774401024728},100,null,"DA/SA"]
[null,null,null,null,null,null,null,null,{"$f":"Cap(C7,D7,F7,G7,C9,D9,F9,G9)","v":356.6459072364085},{"$f":"Distance(C7,D7,F7,G7,C9,D9,F9,G9)","v":2.0396239463529309},null,1,{"$f":"J8*(1+L8/100)","v":2.0600201858164602},null,"SA"]
[null,{"$f":"B7+1","v":3},41,27,{"$f":"IF(OR(C9<0,AND(C9=0,D9<0)),\"S\",\"N\")","v":"N"},9,56,{"$f":"IF(OR(F9<0,AND(F9=0,G9<0)),\"W\",\"E\")","v":"E"},null,null,{"$f":"K7+J8","v":23.733459986971475},null,null,{"$f":"N7+M8","v":23.970794586841187},null,{"$f":"IF(O8=O6,P7+M8,M8)","v":2.0600201858164602},{"$f":"IF(O8=O10,\"\",P9)","v":""},150,null,"A/C 1"]
[null,null,null,null,null,null,null,null,{"$f":"Cap(C9,D9,F9,G9,C11,D11,F11,G11)","v":5.9540840672098918},{"$f":"Distance(C9,D9,F9,G9,C11,D11,F11,G11)","v":40.015404115187621},null,1,{"$f":"J10*(1+L10/100)","v":40.4155581563395},null,"SA"]
[null,{"$f":"B9+1","v":4},41,48.5,{"$f":"IF(OR(C11<0,AND(C11=0,D11<0)),\"S\",\"N\")","v":"N"},9,59,{"$f":"IF(OR(F11<0,AND(F11=0,G11<0)),\"W\",\"E\")","v":"E"},null,null,{"$f":"K9+J10","v":63.748864102159096},null,null,{"$f":"N9+M10","v":64.38635274318068},null,{"$f":"IF(O10=O8,P9+M10,M10)","v":42.475578342155963},{"$f":"IF(O10=O12,\"\",P11)","v":42.475578342155963},700,null,"SA/LWA"]
[null,null,null,null,null,null,null,null,{"$f":"Cap(C11,D11,F11,G11,C13,D13,F13,G13)","v":349.01265239154816},{"$f":"Distance(C11,D11,F11,G11,C13,D13,F13,G13)","v":21.688794623529972},null,2,{"$f":"J12*(1+L12/100)","v":22.122570516000572},null,"LWA"]
[null,{"$f":"B11+1","v":5},42,0,{"$f":"IF(OR(C13<0,AND(C13=0,D13<0)),\"S\",\"N\")","v":"N"},9,56,{"$f":"IF(OR(F13<0,AND(F13=0,G13<0)),\"W\",\"E\")","v":"E"},null,null,{"$f":"K11+J12","v":85.437658725689062},null,null,{"$f":"N11+M12","v":86.508923259181245},null,{"$f":"IF(O12=O10,P11+M12,M12)","v":22.122570516000572},{"$f":"IF(O12=O14,\"\",P13)","v":""},1100,null,"A/C 2"]
[null,null,null,null,null,null,null,null,{"$f":"Cap(C13,D13,F13,G13,C15,D15,F15,G15)","v":54.638943752265391},{"$f":"Distance(C13,D13,F13,G13,C15,D15,F15,G15)","v":58.316072412486868},null,2,{"$f":"J14*(1+L14/100)","v":59.482393860736607},null,"LWA"]
[null,{"$f":"B13+1","v":6},42,18.184999999999999,{"$f":"IF(OR(C15<0,AND(C15=0,D15<0)),\"S\",\"N\")","v":"N"},10,30.565999999999999,{"$f":"IF(OR(F15<0,AND(F15=0,G15<0)),\"W\",\"E\")","v":"E"},null,null,{"$f":"K13+J14","v":143.75373113817594},null,null,{"$f":"N13+M14","v":145.99131711991785},null,{"$f":"IF(O14=O12,P13+M14,M14)","v":81.604964376737172},{"$f":"IF(O14=O16,\"\",P15)","v":81.604964376737172},1200,null,"LWA/LW"]
[null,null,null,null,null,null,null,null,{"$f":"Cap(C15,D15,F15,G15,C17,D17,F17,G17)","v":54.864503885125288},{"$f":"Distance(C15,D15,F15,G15,C17,D17,F17,G17)","v":32.903216926743916},null,4,{"$f":"J16*(1+L16/100)","v":34.219345603813672},null,"LW"]
[null,{"$f":"B15+1","v":7},42,28.388000000000002,{"$f":"IF(OR(C17<0,AND(C17=0,D17<0)),\"S\",\"N\")","v":"N"},10,50.195999999999998,{"$f":"IF(OR(F17<0,AND(F17=0,G17<0)),\"W\",\"E\")","v":"E"},null,null,{"$f":"K15+J16","v":176.65694806491985},null,null,{"$f":"N15+M16","v":180.21066272373153},null,{"$f":"IF(O16=O14,P15+M16,M16)","v":34.219345603813672},{"$f":"IF(O16=O18,\"\",P17)","v":""},1300,null,"A/C 3"]
[null,null,null,null,null,null,null,null,{"$f":"Cap(C17,D17,F17,G17,C19,D19,F19,G19)","v":55.176564747005187},{"$f":"Distance(C17,D17,F17,G17,C19,D19,F19,G19)","v":90.980205972349239},null,4,{"$f":"J18*(1+L18/100)","v":94.61941421124321},null,"LW"]
[null,{"$f":"B17+1","v":8},42,56.38,{"$f":"IF(OR(C19<0,AND(C19=0,D19<0)),\"S\",\"N\")","v":"N"},11,44.957999999999998,{"$f":"IF(OR(F19<0,AND(F19=0,G19<0)),\"W\",\"E\")","v":"E"},null,null,{"$f":"K17+J18","v":267.63715403726906},null,null,{"$f":"N17+M18","v":274.83007693497473},null,{"$f":"IF(O18=O16,P17+M18,M18)","v":128.83875981505687},{"$f":"IF(O18=O20,\"\",P19)","v":""},1400,null,"A/C 4"]
[null,null,null,null,null,null,null,null,{"$f":"Cap(C19,D19,F19,G19,C21,D21,F21,G21)","v":55.644606790498408},{"$f":"Distance(C19,D19,F19,G19,C21,D21,F21,G21)","v":90.739004792543014},null,4,{"$f":"J20*(1+L20/100)","v":94.368564984244742},null,"LW"]
[null,{"$f":"B19+1","v":9},43,23.966999999999999,{"$f":"IF(OR(C21<0,AND(C21=0,D21<0)),\"S\",\"N\")","v":"N"},12,40.293999999999997,{"$f":"IF(OR(F21<0,AND(F21=0,G21<0)),\"W\",\"E\")","v":"E"},null,null,{"$f":"K19+J20","v":358.37615882981208},null,null,{"$f":"N19+M20","v":369.19864191921948},null,{"$f":"IF(O20=O18,P19+M20,M20)","v":223.2073247993016},{"$f":"IF(O20=O22,\"\",P21)","v":""},1100,null,"A/C 5"]
[null,null,null,null,null,null,null,null,{"$f":"Cap(C21,D21,F21,G21,C23,D23,F23,G23)","v":56.128797747172079},{"$f":"Distance(C21,D21,F21,G21,C23,D23,F23,G23)","v":90.492534852971346},null,4,{"$f":"J22*(1+L22/100)","v":94.112236247090209},null,"LW"]
[null,{"$f":"B21+1","v":10},43,51.136000000000003,{"$f":"IF(OR(C23<0,AND(C23=0,D23<0)),\"S\",\"N\")","v":"N"},13,36.212000000000003,{"$f":"IF(OR(F23<0,AND(F23=0,G23<0)),\"W\",\"E\")","v":"E"},null,null,{"$f":"K21+J22","v":448.86869368278343},null,null,{"$f":"N21+M22","v":463.31087816630969},null,{"$f":"IF(O22=O20,P21+M22,M22)","v":317.31956104639181},{"$f":"IF(O22=O24,\"\",P23)","v":""},2200,null,"A/C 6"]
[null,null,null,null,null,null,null,null,{"$f":"Cap(C23,D23,F23,G23,C25,D25,F25,G25)","v":56.626152698444741},{"$f":"Distance(C23,D23,F23,G23,C25,D25,F25,G25)","v":90.240389034594301},null,4,{"$f":"J24*(1+L24/100)","v":93.850004595978078},null,"LW"]
[null,{"$f":"B23+1","v":11},44,17.876000000000001,{"$f":"IF(OR(C25<0,AND(C25=0,D25<0)),\"S\",\"N\")","v":"N"},14,32.716999999999999,{"$f":"IF(OR(F25<0,AND(F25=0,G25<0)),\"W\",\"E\")","v":"E"},null,null,{"$f":"K23+J24","v":539.10908271737776},null,null,{"$f":"N23+M24","v":557.16088276228777},null,{"$f":"IF(O24=O22,P23+M24,M24)","v":411.16956564236989},{"$f":"IF(O24=O26,\"\",P25)","v":""},2000,null,"A/C 7"]
[null,null,null,null,null,null,null,null,{"$f":"Cap(C25,D25,F25,G25,C27,D27,F27,G27)","v":57.138903909523776},{"$f":"Distance(C25,D25,F25,G25,C27,D27,F27,G27)","v":89.987905341193084},null,4,{"$f":"J26*(1+L26/100)","v":93.587421554840816},null,"LW"]
[null,{"$f":"B25+1","v":12},44,44.176000000000002,{"$f":"IF(OR(C27<0,AND(C27=0,D27<0)),\"S\",\"N\")","v":"N"},15,29.818000000000001,{"$f":"IF(OR(F27<0,AND(F27=0,G27<0)),\"W\",\"E\")","v":"E"},null,null,629.09698805857079,null,null,650.7483043171286,null,{"$f":"IF(O26=O24,P25+M26,M26)","v":504.75698719721072},"",1800,null,"A/C 8"]
[null,null,null,null,null,null,null,null,{"$f":"Cap(C27,D27,F27,G27,C29,D29,F29,G29)","v":57.425444702423761},9.9729658258995304,null,4,10.371884458935511,null,"LW"]
[null,{"$f":"B27+1","v":13},44,47.067999999999998,{"$f":"IF(OR(C29<0,AND(C29=0,D29<0)),\"S\",\"N\")","v":"N"},15,36.192999999999998,{"$f":"IF(OR(F29<0,AND(F29=0,G29<0)),\"W\",\"E\")","v":"E"},null,null,639.06995388447035,null,null,661.12018877606408,null,515.1288716561462,515.1288716561462,1200,null,"LW/LWA"]
[null,null,null,null,null,null,null,null,{"$f":"Cap(C29,D29,F29,G29,C31,D31,F31,G31)","v":57.484733404058687},9.1602441024676082,null,2,9.3434489845169608,null,"LWA"]
[null,{"$f":"B29+1","v":14},44,49.72,{"$f":"IF(OR(C31<0,AND(C31=0,D31<0)),\"S\",\"N\")","v":"N"},15,42.057000000000002,{"$f":"IF(OR(F31<0,AND(F31=0,G31<0)),\"W\",\"E\")","v":"E"},null,null,648.23019798693792,null,null,670.46363776058104,null,9.3434489845169608,9.3434489845169608,700,null,"LWA/SA"]
[null,null,null,null,null,null,null,null,{"$f":"Cap(C31,D31,F31,G31,C33,D33,F33,G33)","v":57.539466794138725},9.270922363248788,null,1,9.3636315868812758,null,"SA"]
[null,{"$f":"B31+1","v":15},44,52.4,{"$f":"IF(OR(C33<0,AND(C33=0,D33<0)),\"S\",\"N\")","v":"N"},15,48,{"$f":"IF(OR(F33<0,AND(F33=0,G33<0)),\"W\",\"E\")","v":"E"},null,null,657.50112035018674,null,null,679.82726934746233,null,9.3636315868812758,"",300,null,"A/C 9"]
[null,null,null,null,null,null,null,null,{"$f":"Cap(C33,D33,F33,G33,C35,D35,F35,G35)","v":79.836435115357432},1.1478920700094291,null,1,1.1593709907095233,null,"SA"]
[null,{"$f":"B33+1","v":16},44,52.509,{"$f":"IF(OR(C35<0,AND(C35=0,D35<0)),\"S\",\"N\")","v":"N"},15,48.857999999999997,{"$f":"IF(OR(F35<0,AND(F35=0,G35<0)),\"W\",\"E\")","v":"E"},null,null,{"$f":"K33+J34","v":658.64901242019619},null,null,{"$f":"N33+M34","v":680.98664033817181},null,10.523002577590798,10.523002577590798,100,null,"SA/DA"]
[null,null,null,null,null,null,null,null,{"$f":"Cap(C35,D35,F35,G35,C37,D37,F37,G37)","v":79.904793110272436},{"$f":"Distance(C35,D35,F35,G35,C37,D37,F37,G37)","v":5.2054351853431191},null,1,{"$f":"J36*(1+L36/100)","v":5.25748953719655},null,"DA"]
[null,{"$f":"B35+1","v":17},44,53,{"$f":"IF(OR(C37<0,AND(C37=0,D37<0)),\"S\",\"N\")","v":"N"},15,52.75,{"$f":"IF(OR(F37<0,AND(F37=0,G37<0)),\"W\",\"E\")","v":"E"},null,null,{"$f":"K35+J36","v":663.85444760553935},null,null,{"$f":"N35+M36","v":686.24412987536834},null,{"$f":"IF(O36=O34,P35+M36,M36)","v":5.25748953719655},5.25748953719655,0,null,"Landing"]

{"sheet":"Spheroides","index":3,"n_rows":56,"n_cols":8,"rows_kept":56,"cut":false,"hidden":false,"merged":[]}
["Liste des Ellipsoides Disponibles"]
[]
[]
[]
[]
[]
[null,null,"Nom","Demi Grand","Demi Petit","e2","n","1 / f"]
[null,1,"AIRY",6377563.3959999997,6356256.909,{"$f":"POWER(1/D8*(SQRT((D8*D8)-(E8*E8))),2)","v":6.6705400741490836E-3},1.6732202503250534E-3,{"$f":"1/((D8-E8)/D8)","v":299.32496126649505}]
[null,2,"AIRY MOD",6377340.1890000002,6356034.4479999999,6.6705399807736503E-3,1.6732203054869081E-3,299.32496546352854]
[null,3,"AUSTRALIAN NATIONAL 1967/84",6378160,6356774.7189999996,6.694541915624532E-3,null,298.24999727615801]
[null,4,"BESSEL 1841",6377397.1550000003,6356078.9630000005,6.6743721749749326E-3,1.6741847868128074E-3,299.15281535132334]
[null,5,"BESSEL 1841 MOD",6377483.8650000002,6356165.3830000004,6.6743722212770787E-3,1.6741847984660181E-3,299.15281327254201]
[null,6,"BESSEL NGO",6377492.0180000002,6356173.5089999996,6.6743721420039794E-3,null,299.152816831601]
[null,7,"BESSEL RD / POTSDAM",6377397.1550000003,6356078.9630000005,6.6743721749749326E-3,null,299.15281535132334]
[null,8,"BROADCAST",6378135,6356750.5199999996,6.6943177832963279E-3,null,298.25999977553192]
[null,9,"CLARKE 1856",6378235.5999999996,6356560.1399999997,6.785145919996286E-3,null,294.26068005015861]
[null,10,"CLARKE 1866",6378206.4000000004,6356583.7999999998,6.7686579972911819E-3,1.6979156829769022E-3,294.97869821389821]
[null,11,"CLARKE 1880",6378249.1449999996,6356514.8700000001,6.8035111421552033E-3,1.7066884768653044E-3,293.46500607911531]
[null,12,"CLARKE 1880 IGN",6378249.2000000002,6356515,6.8034876462998934E-3,null,293.46602129362691]
[null,13,"CLARKE 1880 MOD",6378249.1449999996,6356514.8700000001,6.8035111421552033E-3,1.7066884768653044E-3,293.46500607911531]
[null,14,"CLARKE 1880 (PALESTINE)",6378300.7819999997,6356566.4270000001,6.803481156342152E-3,null,293.46630171450414]
[null,15,"DANISH 1876  / ANDRAE",6377104.4299999997,6355847.415,6.6555556284901502E-3,null,299.99999670697417]
[null,16,"EVEREST (INDE) METRIQUE",6377301.2429999998,6356100.2300000004,6.6378461201175376E-3,null,300.80172315352098]
[null,17,"EVEREST (MALAYA)",6377295.6639999999,6356094.6679999996,6.637846603695206E-3,null,300.80170120309049]
[null,18,"EVEREST 1830",6377276.3449999997,6356075.4129999997,6.6378466740345783E-3,1.6649922505031004E-3,300.80169801025681]
[null,19,"EVEREST 1830 (MOD.)",6377298.5609999998,6356097.5549999997,6.6378467190551368E-3,null,300.80169596669066]
[null,20,"EVEREST BORNEO",6377298.5559999999,6356097.5549999997,6.6378451614016471E-3,null,300.80176667129774]
[null,21,"EVEREST MOD.",6377304.0630000001,6356103.0389999999,6.6378466280601449E-3,null,300.80170009712441]
[null,22,"FISHER 1960 (MERCURY)",6378166,6356784.284,6.6934215001796154E-3,null,298.30000548131846]
[null,23,"FISHER 1968",6378150,6356768.3370000003,6.6934216993408307E-3,null,298.29999659054056]
[null,24,"FISCHER MOD",6378160,6356774.7189999996,6.694541915624532E-3,1.6792611404669755E-3,298.24999727615801]
[null,25,"FISHER MOD. 1960",6378155,6356773.3200000003,6.6934217738298723E-3,null,298.29999326526678]
[null,26,"GRS 67",6378160,6356774.5159999998,6.694605356917795E-3,null,298.24716616186703]
[null,27,"GRS 80",6378137,6356752.3140000002,6.6943800667646578E-3,null,298.25722014342756]
[null,28,"HELMERT 1906",6378200,6356818,6.6934746345492999E-3,1.6789925228217189E-3,298.29763352352444]
[null,29,"HOUGH",6378270,6356794.3430000003,6.7226701580694282E-3,1.6863406749730355E-3,296.99999399320365]
[null,30,"INTERNATIONAL",6378388,6356911.9460000005,6.7226700623166684E-3,1.6863406508729228E-3,296.9999982305938]
[null,31,"JEFFREYS 1948",6378099,6356631,6.7204571463943836E-3,null,297.09795975405251]
[null,32,"KRASSOVSKY",6378245,6356863,6.6934274898192208E-3,1.6789806572508061E-3,298.29973809746514]
[null,33,"PRECISE",6378145,6356759.7690000003,6.6945420073107756E-3,1.6792611635429559E-3,298.2499931845532]
[null,34,"REF ELLIPSOIDE 1967",6378160,6356774.7189999996,6.694541915624532E-3,1.6792611404669755E-3,298.24999727615801]
[null,35,"S AMERICA 1969",6378160,6356774.7189999996,6.694541915624532E-3,1.6792611404669755E-3,298.24999727615801]
[null,36,"STRUVE 1860",6378298.2999999998,6356657.1430000002,6.7743596975477745E-3,null,294.73000450022613]
[null,37,"SVANBERG",6376797,6355837.9709999999,6.5627258654816379E-3,null,304.25059290675966]
[null,38,"WAR OFFICE 1924",6378300,6356751.6890000002,6.7453433754114476E-3,null,295.99999740119182]
[null,39,"WGS 60",6378165,6356783.2869999995,6.6934216102894064E-3,null,298.30000056589779]
[null,40,"WGS 66",6378145,6356759.7690000003,6.6945420073107756E-3,null,298.2499931845532]
[null,41,"WGS 72",6378135,6356750.5199999996,6.6943177832963279E-3,1.6792047299063939E-3,298.25999977553192]
[null,42,"WGS 84",6378137,6356752.3140000002,6.6943800667646578E-3,1.6792204056685965E-3,298.25722014342756]
[null,43]
[null,44]
[null,45]
[null,46]
[]
[]
[null,null," "]