{"text_format":"1","workbook":"xlsx","n_sheets":7,"sheets":["Geodesie","Dialog1","Dialog2","Calcul shift geo","Modele de Route","Spheroides","Table Datum Shifts"],"not_rendered":{"charts":0,"images":0,"macros":1,"external_links":0,"defined_names":2,"comments":0,"pivot_tables":0},"unopened":[{"sheet":"Dialog1","index":1,"reason":"not_a_worksheet"},{"sheet":"Dialog2","index":2,"reason":"not_a_worksheet"},{"sheet":"Calcul shift geo","index":3,"reason":"part_missing"}],"bounds":{"document_bytes":16777216,"sheet_cells":100000,"rows_first":2000,"rows_last":500,"rows_between":2000,"halvings":0,"cell_chars":16384,"cell_head_chars":4096},"cells_cut":0,"cells_raw":0,"read":"whole","date_system":"1904"}

{"sheet":"Geodesie","index":0,"n_rows":26,"n_cols":11,"rows_kept":26,"cut":false,"hidden":false,"merged":[]}
["Paramètres de Base des Géodésies Utilisées"]
[]
["Index",null,null,"Système 1",null,null,"Index",null,null,"Système 2"]
["Datum:",1,null,"Région & Datum:",{"$f":"(INDEX('Table Datum Shifts'!B15:B203,B4))","v":"Monde / WGS84"},null,"Datum:",40,null,"Région & Datum:",{"$f":"(INDEX('Table Datum Shifts'!B15:B203,H4))","v":"Europe / ED50"}]
["Spheroide:",42,null,"Ellipsoïde:",{"$f":"INDEX(Spheroides!C8:C56,B5)","v":"WGS 84"},null,"Sphéroïde:",30,null,"Ellipsoïde",{"$f":"INDEX(Spheroides!C8:C56,H5)","v":"INTERNATIONAL"}]
[null,null,null,"Gd Axe:",{"$f":"INDEX(Spheroides!D8:D56,B5)","v":6378137},null,null,null,null,"Gd Axe",{"$f":"INDEX(Spheroides!D8:D56,H5)","v":6378388}]
[null,null,null,"Pt Axe:",{"$f":"INDEX(Spheroides!E8:E56,B5)","v":6356752.3140000002},null,null,null,null,"Pt Axe",{"$f":"INDEX(Spheroides!E8:E56,H5)","v":6356911.9460000005}]
[null,null,null,"e2",{"$f":"INDEX(Spheroides!F8:F56,B5)","v":6.6943800667646578E-3},null,null,null,null,"e2",{"$f":"INDEX(Spheroides!F8:F56,H5)","v":6.7226700623166684E-3}]
[null,null,null,"n",{"$f":"INDEX(Spheroides!G8:G56,B5)","v":1.6792204056685965E-3},null,null,null,null,"n",{"$f":"INDEX(Spheroides!G8:G56,H5)","v":1.6863406508729228E-3}]
[null,null,null,"1 / f",{"$f":"INDEX(Spheroides!H8:H56,B5)","v":298.25722014342756},null,null,null,null,"1 / f",{"$f":"INDEX(Spheroides!H8:H56,H5)","v":296.9999982305938}]
[]
[]
[]
[]
[]
[null,null,null,"Datum Shifts de 1 vers 2"]
[null,null,null,"Dx",89.5]
[null,null,null,"Dy",93.8]
[null,null,null,"Dz",123.1]
[null,null,null,"Rx",0]
[null,null,null,"Ry",0]
[null,null,null,"Rz",0.156]
[null,null,null,"ppm",-1.2]
[]
["\"+0089,50;+0093,80;+0123,10;-0,000;-0,000;+0,156;-1,200\""]
[{"$f":"INDEX('Table Datum Shifts'!D15:GC203,H4,B4)","v":"\"-0089,50;-0093,80;-0123,10;-0,000;-0,000;-0,156;+1,200\""}]

{"sheet":"Modele de Route","index":4,"n_rows":71,"n_cols":30,"rows_kept":71,"cut":false,"hidden":false,"merged":[]}
["Version du 07/11/97","Position",{"$f":"Geodesie!E4","v":"Monde / WGS84"},null,null,null,null,null,null,"Geographical",null,null,{"$f":"Geodesie!K4","v":"Europe / ED50"},null,null,null,null,null,"Geographical",null,null,"Slack","Cable Distance",null,"Cable","Cumulative","Totals","Approx"]
["Christian Auroux","Number","Latitude",null,null,"Longitude",null,null,"Heading","Length","Cumul.",null,"Latitude",null,null,"Longitude",null,null,"Length","Cumul.",null,"%","Length","Cumul.","Type","by type","By Type","Depth",null,"Comments"]
["convgeogeo",null,null,null,null,null,null,null,null,"(km)","(km)",null,null,null,null,null,null,null,"(km)","(km)",null,null,"(km)","(km)",null,null,"(km)","(m)"]
[]
[null,1,36,47.551000000000002,{"$f":"IF(OR(C5<0,AND(C5=0,D5<0)),\"S\",\"N\")","v":"N"},22,52.758000000000003,{"$f":"IF(OR(F5<0,AND(F5=0,G5<0)),\"W\",\"E\")","v":"E"},null,null,0,null,{"$f":"TRUNC(geoshiftlat(C5,D5,F5,G5),0)","v":36},{"$f":"(geoshiftlat(C5,D5,F5,G5)-M5)*60","v":47.613141626559212},{"$f":"IF(OR(M5<0,AND(M5=0,N5<0)),\"S\",\"N\")","v":"N"},{"$f":"TRUNC(geoshiftlon(C5,D5,F5,G5),0)","v":22},{"$f":"(geoshiftlon(C5,D5,F5,G5)-P5)*60","v":52.795302948926093},{"$f":"IF(OR(P5<0,AND(P5=0,Q5<0)),\"W\",\"E\")","v":"E"},null,0,null,null,null,0,null,0,{"$f":"IF(Y4=Y6,\"\",Z5)","v":0},0,null,"Landing Point"]
[null,null,null,null,null,null,null,null,{"$f":"CAP(C5,D5,F5,G5,C7,D7,F7,G7)","v":52.663686330934596},{"$f":"Distance1(C5,D5,F5,G5,C7,D7,F7,G7)","v":175.2109585705135},null,null,null,null,null,null,null,null,{"$f":"Distance2(M5,N5,P5,Q5,M7,N7,P7,Q7)","v":175.20791373263708},null,null,2,{"$f":"S6*(1+V6/100)","v":178.71207200728983},null,"DA"]
[null,{"$f":"B5+1","v":2},37,45,{"$f":"IF(OR(C7<0,AND(C7=0,D7<0)),\"S\",\"N\")","v":"N"},23,87,{"$f":"IF(OR(F7<0,AND(F7=0,G7<0)),\"W\",\"E\")","v":"E"},null,null,{"$f":"K5+J6","v":175.2109585705135},null,{"$f":"TRUNC(geoshiftlat(C7,D7,F7,G7),0)","v":37},{"$f":"(geoshiftlat(C7,D7,F7,G7)-M7)*60","v":45.060594429022132},{"$f":"IF(OR(M7<0,AND(M7=0,N7<0)),\"S\",\"N\")","v":"N"},{"$f":"TRUNC(geoshiftlon(C7,D7,F7,G7),0)","v":24},{"$f":"(geoshiftlon(C7,D7,F7,G7)-P7)*60","v":27.035512684444285},{"$f":"IF(OR(P7<0,AND(P7=0,Q7<0)),\"W\",\"E\")","v":"E"},null,{"$f":"T5+S6","v":175.20791373263708},null,null,null,{"$f":"X5+W6","v":178.71207200728983},null,{"$f":"IF(Y6=Y4,Z5+W6,W6)","v":178.71207200728983},{"$f":"IF(Y6=Y8,\"\",Z7)","v":""},50,null,"*"]
[null,null,null,null,null,null,null,null,{"$f":"CAP(C7,D7,F7,G7,C9,D9,F9,G9)","v":275.24620753317743},{"$f":"Distance1(C7,D7,F7,G7,C9,D9,F9,G9)","v":50.57841048796449},null,null,null,null,null,null,null,null,50.576804824270816,null,null,2,51.588340920756231,null,"DA"]
[null,{"$f":"B7+1","v":3},37,47.5,{"$f":"IF(OR(C9<0,AND(C9=0,D9<0)),\"S\",\"N\")","v":"N"},23,52.7,{"$f":"IF(OR(F9<0,AND(F9=0,G9<0)),\"W\",\"E\")","v":"E"},null,null,{"$f":"K7+J8","v":225.78936905847797},null,{"$f":"TRUNC(geoshiftlat(C9,D9,F9,G9),0)","v":37},{"$f":"(geoshiftlat(C9,D9,F9,G9)-M9)*60","v":47.560706888483253},{"$f":"IF(OR(M9<0,AND(M9=0,N9<0)),\"S\",\"N\")","v":"N"},{"$f":"TRUNC(geoshiftlon(C9,D9,F9,G9),0)","v":23},{"$f":"(geoshiftlon(C9,D9,F9,G9)-P9)*60","v":52.736347106071833},{"$f":"IF(OR(P9<0,AND(P9=0,Q9<0)),\"W\",\"E\")","v":"E"},null,{"$f":"T7+S8","v":225.7847185569079},null,null,null,{"$f":"X7+W8","v":230.30041292804606},null,{"$f":"IF(Y8=Y6,Z7+W8,W8)","v":230.30041292804606},{"$f":"IF(Y8=Y10,\"\",Z9)","v":230.30041292804606},100,null,"DA/SA"]
[null,null,null,null,null,null,null,null,{"$f":"CAP(C9,D9,F9,G9,C11,D11,F11,G11)","v":184.23954447669777},{"$f":"Distance1(C9,D9,F9,G9,C11,D11,F11,G11)","v":13.911987037449761},null,null,null,null,null,null,null,null,13.912086388243926,null,null,2,14.190328116008805,null,"SA"]
[null,{"$f":"B9+1","v":4},37,40,{"$f":"IF(OR(C11<0,AND(C11=0,D11<0)),\"S\",\"N\")","v":"N"},23,52,{"$f":"IF(OR(F11<0,AND(F11=0,G11<0)),\"W\",\"E\")","v":"E"},null,null,{"$f":"K9+J10","v":239.70135609592774},null,{"$f":"TRUNC(geoshiftlat(C11,D11,F11,G11),0)","v":37},{"$f":"(geoshiftlat(C11,D11,F11,G11)-M11)*60","v":40.060857357539987},{"$f":"IF(OR(M11<0,AND(M11=0,N11<0)),\"S\",\"N\")","v":"N"},{"$f":"TRUNC(geoshiftlon(C11,D11,F11,G11),0)","v":23},{"$f":"(geoshiftlon(C11,D11,F11,G11)-P11)*60","v":52.036307019990602},{"$f":"IF(OR(P11<0,AND(P11=0,Q11<0)),\"W\",\"E\")","v":"E"},null,{"$f":"T9+S10","v":239.69680494515183},null,null,null,{"$f":"X9+W10","v":244.49074104405486},null,{"$f":"IF(Y10=Y8,Z9+W10,W10)","v":14.190328116008805},{"$f":"IF(Y10=Y12,\"\",Z11)","v":""},220,null,"*"]
[null,null,null,null,null,null,null,null,{"$f":"CAP(C11,D11,F11,G11,C13,D13,F13,G13)","v":5.4443672253539512},{"$f":"Distance1(C11,D11,F11,G11,C13,D13,F13,G13)","v":13.936791307820892},null,null,null,null,null,null,null,null,13.936888891519409,null,null,2,14.215626669349797,null,"SA"]
[null,{"$f":"B11+1","v":5},37,47.5,{"$f":"IF(OR(C13<0,AND(C13=0,D13<0)),\"S\",\"N\")","v":"N"},23,52.9,{"$f":"IF(OR(F13<0,AND(F13=0,G13<0)),\"W\",\"E\")","v":"E"},null,null,{"$f":"K11+J12","v":253.63814740374863},null,{"$f":"TRUNC(geoshiftlat(C13,D13,F13,G13),0)","v":37},{"$f":"(geoshiftlat(C13,D13,F13,G13)-M13)*60","v":47.560705933794338},{"$f":"IF(OR(M13<0,AND(M13=0,N13<0)),\"S\",\"N\")","v":"N"},{"$f":"TRUNC(geoshiftlon(C13,D13,F13,G13),0)","v":23},{"$f":"(geoshiftlon(C13,D13,F13,G13)-P13)*60","v":52.936342358013064},{"$f":"IF(OR(P13<0,AND(P13=0,Q13<0)),\"W\",\"E\")","v":"E"},null,{"$f":"T11+S12","v":253.63369383667123},null,null,null,{"$f":"X11+W12","v":258.70636771340463},null,{"$f":"IF(Y12=Y10,Z11+W12,W12)","v":28.405954785358603},{"$f":"IF(Y12=Y14,\"\",Z13)","v":""},220,null,"*"]
[null,null,null,null,null,null,null,null,{"$f":"CAP(C13,D13,F13,G13,C15,D15,F15,G15)","v":292.78468343671614},{"$f":"Distance1(C13,D13,F13,G13,C15,D15,F15,G15)","v":0.23883593692395114},null,null,null,null,null,null,null,null,{"$f":"Distance2(M13,N13,P13,Q13,M15,N15,P15,Q15)","v":0.23882969277984731},null,null,2,{"$f":"S14*(1+V14/100)","v":0.24360628663544426},null,"SA"]
[null,{"$f":"B13+1","v":6},37,47.55,{"$f":"IF(OR(C15<0,AND(C15=0,D15<0)),\"S\",\"N\")","v":"N"},23,52.75,{"$f":"IF(OR(F15<0,AND(F15=0,G15<0)),\"W\",\"E\")","v":"E"},null,null,{"$f":"K13+J14","v":253.87698334067258},null,{"$f":"TRUNC(geoshiftlat(C15,D15,F15,G15),0)","v":37},{"$f":"(geoshiftlat(C15,D15,F15,G15)-M15)*60","v":47.610705665652091},{"$f":"IF(OR(M15<0,AND(M15=0,N15<0)),\"S\",\"N\")","v":"N"},{"$f":"TRUNC(geoshiftlon(C15,D15,F15,G15),0)","v":23},{"$f":"(geoshiftlon(C15,D15,F15,G15)-P15)*60","v":52.786346298072147},{"$f":"IF(OR(P15<0,AND(P15=0,Q15<0)),\"W\",\"E\")","v":"E"},null,{"$f":"T13+S14","v":253.87252352945109},null,null,null,{"$f":"X13+W14","v":258.94997400004007},null,{"$f":"IF(Y14=Y12,Z13+W14,W14)","v":28.649561071994047},{"$f":"IF(Y14=Y16,\"\",Z15)","v":""},300,null,"*"]
[null,null,null,null,null,null,null,null,{"$f":"CAP(C15,D15,F15,G15,C17,D17,F17,G17)","v":0},{"$f":"Distance1(C15,D15,F15,G15,C17,D17,F17,G17)","v":0},null,null,null,null,null,null,null,null,{"$f":"Distance2(M15,N15,P15,Q15,M17,N17,P17,Q17)","v":0},null,null,2,{"$f":"S16*(1+V16/100)","v":0},null,"SA"]
[null,{"$f":"B15+1","v":7},37,47.55,{"$f":"IF(OR(C17<0,AND(C17=0,D17<0)),\"S\",\"N\")","v":"N"},23,52.75,{"$f":"IF(OR(F17<0,AND(F17=0,G17<0)),\"W\",\"E\")","v":"E"},null,null,{"$f":"K15+J16","v":253.87698334067258},null,{"$f":"TRUNC(geoshiftlat(C17,D17,F17,G17),0)","v":37},{"$f":"(geoshiftlat(C17,D17,F17,G17)-M17)*60","v":47.610705665652091},{"$f":"IF(OR(M17<0,AND(M17=0,N17<0)),\"S\",\"N\")","v":"N"},{"$f":"TRUNC(geoshiftlon(C17,D17,F17,G17),0)","v":23},{"$f":"(geoshiftlon(C17,D17,F17,G17)-P17)*60","v":52.786346298072147},{"$f":"IF(OR(P17<0,AND(P17=0,Q17<0)),\"W\",\"E\")","v":"E"},null,{"$f":"T15+S16","v":253.87252352945109},null,null,null,{"$f":"X15+W16","v":258.94997400004007},null,{"$f":"IF(Y16=Y14,Z15+W16,W16)","v":28.649561071994047},{"$f":"IF(Y16=Y18,\"\",Z17)","v":""},350,null,"*"]
[null,null,null,null,null,null,null,null,{"$f":"CAP(C17,D17,F17,G17,C19,D19,F19,G19)","v":0},{"$f":"Distance1(C17,D17,F17,G17,C19,D19,F19,G19)","v":0},null,null,null,null,null,null,null,null,{"$f":"Distance2(M17,N17,P17,Q17,M19,N19,P19,Q19)","v":0},null,null,2,{"$f":"S18*(1+V18/100)","v":0},null,"SA"]
[null,{"$f":"B17+1","v":8},37,47.55,{"$f":"IF(OR(C19<0,AND(C19=0,D19<0)),\"S\",\"N\")","v":"N"},23,52.75,{"$f":"IF(OR(F19<0,AND(F19=0,G19<0)),\"W\",\"E\")","v":"E"},null,null,{"$f":"K17+J18","v":253.87698334067258},null,{"$f":"TRUNC(geoshiftlat(C19,D19,F19,G19),0)","v":37},{"$f":"(geoshiftlat(C19,D19,F19,G19)-M19)*60","v":47.610705665652091},{"$f":"IF(OR(M19<0,AND(M19=0,N19<0)),\"S\",\"N\")","v":"N"},{"$f":"TRUNC(geoshiftlon(C19,D19,F19,G19),0)","v":23},{"$f":"(geoshiftlon(C19,D19,F19,G19)-P19)*60","v":52.786346298072147},{"$f":"IF(OR(P19<0,AND(P19=0,Q19<0)),\"W\",\"E\")","v":"E"},null,{"$f":"T17+S18","v":253.87252352945109},null,null,null,{"$f":"X17+W18","v":258.94997400004007},null,{"$f":"IF(Y18=Y16,Z17+W18,W18)","v":28.649561071994047},{"$f":"IF(Y18=Y20,\"\",Z19)","v":""},380,null,"Crossing"]
[null,null,null,null,null,null,null,null,{"$f":"CAP(C19,D19,F19,G19,C21,D21,F21,G21)","v":0},{"$f":"Distance1(C19,D19,F19,G19,C21,D21,F21,G21)","v":0},null,null,null,null,null,null,null,null,{"$f":"Distance2(M19,N19,P19,Q19,M21,N21,P21,Q21)","v":0},null,null,2,{"$f":"S20*(1+V20/100)","v":0},null,"SA"]
[null,{"$f":"B19+1","v":9},37,47.55,{"$f":"IF(OR(C21<0,AND(C21=0,D21<0)),\"S\",\"N\")","v":"N"},23,52.75,{"$f":"IF(OR(F21<0,AND(F21=0,G21<0)),\"W\",\"E\")","v":"E"},null,null,{"$f":"K19+J20","v":253.87698334067258},null,{"$f":"TRUNC(geoshiftlat(C21,D21,F21,G21),0)","v":37},{"$f":"(geoshiftlat(C21,D21,F21,G21)-M21)*60","v":47.610705665652091},{"$f":"IF(OR(M21<0,AND(M21=0,N21<0)),\"S\",\"N\")","v":"N"},{"$f":"TRUNC(geoshiftlon(C21,D21,F21,G21),0)","v":23},{"$f":"(geoshiftlon(C21,D21,F21,G21)-P21)*60","v":52.786346298072147},{"$f":"IF(OR(P21<0,AND(P21=0,Q21<0)),\"W\",\"E\")","v":"E"},null,{"$f":"T19+S20","v":253.87252352945109},null,null,null,{"$f":"X19+W20","v":258.94997400004007},null,{"$f":"IF(Y20=Y18,Z19+W20,W20)","v":28.649561071994047},{"$f":"IF(Y20=Y22,\"\",Z21)","v":""},400,null,"*"]
[null,null,null,null,null,null,null,null,{"$f":"CAP(C21,D21,F21,G21,C23,D23,F23,G23)","v":0},{"$f":"Distance1(C21,D21,F21,G21,C23,D23,F23,G23)","v":0},null,null,null,null,null,null,null,null,{"$f":"Distance2(M21,N21,P21,Q21,M23,N23,P23,Q23)","v":0},null,null,2,{"$f":"S22*(1+V22/100)","v":0},null,"SA"]
[null,{"$f":"B21+1","v":10},37,47.55,{"$f":"IF(OR(C23<0,AND(C23=0,D23<0)),\"S\",\"N\")","v":"N"},23,52.75,{"$f":"IF(OR(F23<0,AND(F23=0,G23<0)),\"W\",\"E\")","v":"E"},null,null,{"$f":"K21+J22","v":253.87698334067258},null,{"$f":"TRUNC(geoshiftlat(C23,D23,F23,G23),0)","v":37},{"$f":"(geoshiftlat(C23,D23,F23,G23)-M23)*60","v":47.610705665652091},{"$f":"IF(OR(M23<0,AND(M23=0,N23<0)),\"S\",\"N\")","v":"N"},{"$f":"TRUNC(geoshiftlon(C23,D23,F23,G23),0)","v":23},{"$f":"(geoshiftlon(C23,D23,F23,G23)-P23)*60","v":52.786346298072147},{"$f":"IF(OR(P23<0,AND(P23=0,Q23<0)),\"W\",\"E\")","v":"E"},null,{"$f":"T21+S22","v":253.87252352945109},null,null,null,{"$f":"X21+W22","v":258.94997400004007},null,{"$f":"IF(Y22=Y20,Z21+W22,W22)","v":28.649561071994047},{"$f":"IF(Y22=Y24,\"\",Z23)","v":28.649561071994047},700,null,"SA/LWA"]
[null,null,null,null,null,null,null,null,{"$f":"CAP(C23,D23,F23,G23,C25,D25,F25,G25)","v":0},{"$f":"Distance1(C23,D23,F23,G23,C25,D25,F25,G25)","v":0},null,null,null,null,null,null,null,null,{"$f":"Distance2(M23,N23,P23,Q23,M25,N25,P25,Q25)","v":0},null,null,2,{"$f":"S24*(1+V24/100)","v":0},null,"LWA"]
[null,{"$f":"B23+1","v":11},37,47.55,{"$f":"IF(OR(C25<0,AND(C25=0,D25<0)),\"S\",\"N\")","v":"N"},23,52.75,{"$f":"IF(OR(F25<0,AND(F25=0,G25<0)),\"W\",\"E\")","v":"E"},null,null,{"$f":"K23+J24","v":253.87698334067258},null,{"$f":"TRUNC(geoshiftlat(C25,D25,F25,G25),0)","v":37},{"$f":"(geoshiftlat(C25,D25,F25,G25)-M25)*60","v":47.610705665652091},{"$f":"IF(OR(M25<0,AND(M25=0,N25<0)),\"S\",\"N\")","v":"N"},{"$f":"TRUNC(geoshiftlon(C25,D25,F25,G25),0)","v":23},{"$f":"(geoshiftlon(C25,D25,F25,G25)-P25)*60","v":52.786346298072147},{"$f":"IF(OR(P25<0,AND(P25=0,Q25<0)),\"W\",\"E\")","v":"E"},null,{"$f":"T23+S24","v":253.87252352945109},null,null,null,{"$f":"X23+W24","v":258.94997400004007},null,{"$f":"IF(Y24=Y22,Z23+W24,W24)","v":0},{"$f":"IF(Y24=Y26,\"\",Z25)","v":""},850,null,"*"]
[null,null,null,null,null,null,null,null,{"$f":"CAP(C25,D25,F25,G25,C27,D27,F27,G27)","v":0},{"$f":"Distance1(C25,D25,F25,G25,C27,D27,F27,G27)","v":0},null,null,null,null,null,null,null,null,{"$f":"Distance2(M25,N25,P25,Q25,M27,N27,P27,Q27)","v":0},null,null,2,{"$f":"S26*(1+V26/100)","v":0},null,"LWA"]
[null,{"$f":"B25+1","v":12},37,47.55,{"$f":"IF(OR(C27<0,AND(C27=0,D27<0)),\"S\",\"N\")","v":"N"},23,52.75,{"$f":"IF(OR(F27<0,AND(F27=0,G27<0)),\"W\",\"E\")","v":"E"},null,null,{"$f":"K25+J26","v":253.87698334067258},null,{"$f":"TRUNC(geoshiftlat(C27,D27,F27,G27),0)","v":37},{"$f":"(geoshiftlat(C27,D27,F27,G27)-M27)*60","v":47.610705665652091},{"$f":"IF(OR(M27<0,AND(M27=0,N27<0)),\"S\",\"N\")","v":"N"},{"$f":"TRUNC(geoshiftlon(C27,D27,F27,G27),0)","v":23},{"$f":"(geoshiftlon(C27,D27,F27,G27)-P27)*60","v":52.786346298072147},{"$f":"IF(OR(P27<0,AND(P27=0,Q27<0)),\"W\",\"E\")","v":"E"},null,{"$f":"T25+S26","v":253.87252352945109},null,null,null,{"$f":"X25+W26","v":258.94997400004007},null,{"$f":"IF(Y26=Y24,Z25+W26,W26)","v":0},{"$f":"IF(Y26=Y28,\"\",Z27)","v":0},700,null,"LWA/SA"]
[null,null,null,null,null,null,null,null,{"$f":"CAP(C27,D27,F27,G27,C29,D29,F29,G29)","v":0},{"$f":"Distance1(C27,D27,F27,G27,C29,D29,F29,G29)","v":0},null,null,null,null,null,null,null,null,{"$f":"Distance2(M27,N27,P27,Q27,M29,N29,P29,Q29)","v":0},null,null,2,{"$f":"S28*(1+V28/100)","v":0},null,"SA"]
[null,{"$f":"B27+1","v":13},37,47.55,{"$f":"IF(OR(C29<0,AND(C29=0,D29<0)),\"S\",\"N\")","v":"N"},23,52.75,{"$f":"IF(OR(F29<0,AND(F29=0,G29<0)),\"W\",\"E\")","v":"E"},null,null,{"$f":"K27+J28","v":253.87698334067258},null,{"$f":"TRUNC(geoshiftlat(C29,D29,F29,G29),0)","v":37},{"$f":"(geoshiftlat(C29,D29,F29,G29)-M29)*60","v":47.610705665652091},{"$f":"IF(OR(M29<0,AND(M29=0,N29<0)),\"S\",\"N\")","v":"N"},{"$f":"TRUNC(geoshiftlon(C29,D29,F29,G29),0)","v":23},{"$f":"(geoshiftlon(C29,D29,F29,G29)-P29)*60","v":52.786346298072147},{"$f":"IF(OR(P29<0,AND(P29=0,Q29<0)),\"W\",\"E\")","v":"E"},null,{"$f":"T27+S28","v":253.87252352945109},null,null,null,{"$f":"X27+W28","v":258.94997400004007},null,{"$f":"IF(Y28=Y26,Z27+W28,W28)","v":0},{"$f":"IF(Y28=Y30,\"\",Z29)","v":""},450,null,"*"]
[null,null,null,null,null,null,null,null,{"$f":"CAP(C29,D29,F29,G29,C31,D31,F31,G31)","v":0},{"$f":"Distance1(C29,D29,F29,G29,C31,D31,F31,G31)","v":0},null,null,null,null,null,null,null,null,{"$f":"Distance2(M29,N29,P29,Q29,M31,N31,P31,Q31)","v":0},null,null,2,{"$f":"S30*(1+V30/100)","v":0},null,"SA"]
[null,{"$f":"B29+1","v":14},37,47.55,{"$f":"IF(OR(C31<0,AND(C31=0,D31<0)),\"S\",\"N\")","v":"N"},23,52.75,{"$f":"IF(OR(F31<0,AND(F31=0,G31<0)),\"W\",\"E\")","v":"E"},null,null,{"$f":"K29+J30","v":253.87698334067258},null,{"$f":"TRUNC(geoshiftlat(C31,D31,F31,G31),0)","v":37},{"$f":"(geoshiftlat(C31,D31,F31,G31)-M31)*60","v":47.610705665652091},{"$f":"IF(OR(M31<0,AND(M31=0,N31<0)),\"S\",\"N\")","v":"N"},{"$f":"TRUNC(geoshiftlon(C31,D31,F31,G31),0)","v":23},{"$f":"(geoshiftlon(C31,D31,F31,G31)-P31)*60","v":52.786346298072147},{"$f":"IF(OR(P31<0,AND(P31=0,Q31<0)),\"W\",\"E\")","v":"E"},null,{"$f":"T29+S30","v":253.87252352945109},null,null,null,{"$f":"X29+W30","v":258.94997400004007},null,{"$f":"IF(Y30=Y28,Z29+W30,W30)","v":0},{"$f":"IF(Y30=Y32,\"\",Z31)","v":""},200,null,"*"]
[null,null,null,null,null,null,null,null,{"$f":"CAP(C31,D31,F31,G31,C33,D33,F33,G33)","v":0},{"$f":"Distance1(C31,D31,F31,G31,C33,D33,F33,G33)","v":0},null,null,null,null,null,null,null,null,{"$f":"Distance2(M31,N31,P31,Q31,M33,N33,P33,Q33)","v":0},null,null,2,{"$f":"S32*(1+V32/100)","v":0},null,"SA"]
[null,{"$f":"B31+1","v":15},37,47.55,{"$f":"IF(OR(C33<0,AND(C33=0,D33<0)),\"S\",\"N\")","v":"N"},23,52.75,{"$f":"IF(OR(F33<0,AND(F33=0,G33<0)),\"W\",\"E\")","v":"E"},null,null,{"$f":"K31+J32","v":253.87698334067258},null,{"$f":"TRUNC(geoshiftlat(C33,D33,F33,G33),0)","v":37},{"$f":"(geoshiftlat(C33,D33,F33,G33)-M33)*60","v":47.610705665652091},{"$f":"IF(OR(M33<0,AND(M33=0,N33<0)),\"S\",\"N\")","v":"N"},{"$f":"TRUNC(geoshiftlon(C33,D33,F33,G33),0)","v":23},{"$f":"(geoshiftlon(C33,D33,F33,G33)-P33)*60","v":52.786346298072147},{"$f":"IF(OR(P33<0,AND(P33=0,Q33<0)),\"W\",\"E\")","v":"E"},null,{"$f":"T31+S32","v":253.87252352945109},null,null,null,{"$f":"X31+W32","v":258.94997400004007},null,{"$f":"IF(Y32=Y30,Z31+W32,W32)","v":0},{"$f":"IF(Y32=Y34,\"\",Z33)","v":0},100,null,"SA/DA"]
[null,null,null,null,null,null,null,null,{"$f":"CAP(C33,D33,F33,G33,C35,D35,F35,G35)","v":0},{"$f":"Distance1(C33,D33,F33,G33,C35,D35,F35,G35)","v":0},null,null,null,null,null,null,null,null,{"$f":"Distance2(M33,N33,P33,Q33,M35,N35,P35,Q35)","v":0},null,null,2,{"$f":"S34*(1+V34/100)","v":0},null,"DA"]
[null,{"$f":"B33+1","v":16},37,47.55,{"$f":"IF(OR(C35<0,AND(C35=0,D35<0)),\"S\",\"N\")","v":"N"},23,52.75,{"$f":"IF(OR(F35<0,AND(F35=0,G35<0)),\"W\",\"E\")","v":"E"},null,null,{"$f":"K33+J34","v":253.87698334067258},null,{"$f":"TRUNC(geoshiftlat(C35,D35,F35,G35),0)","v":37},{"$f":"(geoshiftlat(C35,D35,F35,G35)-M35)*60","v":47.610705665652091},{"$f":"IF(OR(M35<0,AND(M35=0,N35<0)),\"S\",\"N\")","v":"N"},{"$f":"TRUNC(geoshiftlon(C35,D35,F35,G35),0)","v":23},{"$f":"(geoshiftlon(C35,D35,F35,G35)-P35)*60","v":52.786346298072147},{"$f":"IF(OR(P35<0,AND(P35=0,Q35<0)),\"W\",\"E\")","v":"E"},null,{"$f":"T33+S34","v":253.87252352945109},null,null,null,{"$f":"X33+W34","v":258.94997400004007},null,{"$f":"IF(Y34=Y32,Z33+W34,W34)","v":0},{"$f":"IF(Y34=Y36,\"\",Z35)","v":""},0,null,"Landing"]
[null,null,null,null,null,null,null,null,{"$f":"CAP(C35,D35,F35,G35,C37,D37,F37,G37)","v":0},{"$f":"Distance1(C35,D35,F35,G35,C37,D37,F37,G37)","v":0},null,null,null,null,null,null,null,null,{"$f":"Distance2(M35,N35,P35,Q35,M37,N37,P37,Q37)","v":0},null,null,2,{"$f":"S36*(1+V36/100)","v":0},null,"DA"]
[null,{"$f":"B35+1","v":17},37,47.55,{"$f":"IF(OR(C37<0,AND(C37=0,D37<0)),\"S\",\"N\")","v":"N"},23,52.75,{"$f":"IF(OR(F37<0,AND(F37=0,G37<0)),\"W\",\"E\")","v":"E"},null,null,{"$f":"K35+J36","v":253.87698334067258},null,{"$f":"TRUNC(geoshiftlat(C37,D37,F37,G37),0)","v":37},{"$f":"(geoshiftlat(C37,D37,F37,G37)-M37)*60","v":47.610705665652091},{"$f":"IF(OR(M37<0,AND(M37=0,N37<0)),\"S\",\"N\")","v":"N"},{"$f":"TRUNC(geoshiftlon(C37,D37,F37,G37),0)","v":23},{"$f":"(geoshiftlon(C37,D37,F37,G37)-P37)*60","v":52.786346298072147},{"$f":"IF(OR(P37<0,AND(P37=0,Q37<0)),\"W\",\"E\")","v":"E"},null,{"$f":"T35+S36","v":253.87252352945109},null,null,null,{"$f":"X35+W36","v":258.94997400004007},null,{"$f":"IF(Y36=Y34,Z35+W36,W36)","v":0},{"$f":"IF(Y36=Y38,\"\",Z37)","v":0},100,null,"DA/SA"]
[null,null,null,null,null,null,null,null,{"$f":"CAP(C37,D37,F37,G37,C39,D39,F39,G39)","v":0},{"$f":"Distance1(C37,D37,F37,G37,C39,D39,F39,G39)","v":0},null,null,null,null,null,null,null,null,{"$f":"Distance2(M37,N37,P37,Q37,M39,N39,P39,Q39)","v":0},null,null,2,{"$f":"S38*(1+V38/100)","v":0},null,"SA"]
[null,{"$f":"B37+1","v":18},37,47.55,{"$f":"IF(OR(C39<0,AND(C39=0,D39<0)),\"S\",\"N\")","v":"N"},23,52.75,{"$f":"IF(OR(F39<0,AND(F39=0,G39<0)),\"W\",\"E\")","v":"E"},null,null,{"$f":"K37+J38","v":253.87698334067258},null,{"$f":"TRUNC(geoshiftlat(C39,D39,F39,G39),0)","v":37},{"$f":"(geoshiftlat(C39,D39,F39,G39)-M39)*60","v":47.610705665652091},{"$f":"IF(OR(M39<0,AND(M39=0,N39<0)),\"S\",\"N\")","v":"N"},{"$f":"TRUNC(geoshiftlon(C39,D39,F39,G39),0)","v":23},{"$f":"(geoshiftlon(C39,D39,F39,G39)-P39)*60","v":52.786346298072147},{"$f":"IF(OR(P39<0,AND(P39=0,Q39<0)),\"W\",\"E\")","v":"E"},null,{"$f":"T37+S38","v":253.87252352945109},null,null,null,{"$f":"X37+W38","v":258.94997400004007},null,{"$f":"IF(Y38=Y36,Z37+W38,W38)","v":0},{"$f":"IF(Y38=Y40,\"\",Z39)","v":""},200,null,"*"]
[null,null,null,null,null,null,null,null,{"$f":"CAP(C39,D39,F39,G39,C41,D41,F41,G41)","v":0},{"$f":"Distance1(C39,D39,F39,G39,C41,D41,F41,G41)","v":0},null,null,null,null,null,null,null,null,{"$f":"Distance2(M39,N39,P39,Q39,M41,N41,P41,Q41)","v":0},null,null,2,{"$f":"S40*(1+V40/100)","v":0},null,"SA"]
[null,{"$f":"B39+1","v":19},37,47.55,{"$f":"IF(OR(C41<0,AND(C41=0,D41<0)),\"S\",\"N\")","v":"N"},23,52.75,{"$f":"IF(OR(F41<0,AND(F41=0,G41<0)),\"W\",\"E\")","v":"E"},null,null,{"$f":"K39+J40","v":253.87698334067258},null,{"$f":"TRUNC(geoshiftlat(C41,D41,F41,G41),0)","v":37},{"$f":"(geoshiftlat(C41,D41,F41,G41)-M41)*60","v":47.610705665652091},{"$f":"IF(OR(M41<0,AND(M41=0,N41<0)),\"S\",\"N\")","v":"N"},{"$f":"TRUNC(geoshiftlon(C41,D41,F41,G41),0)","v":23},{"$f":"(geoshiftlon(C41,D41,F41,G41)-P41)*60","v":52.786346298072147},{"$f":"IF(OR(P41<0,AND(P41=0,Q41<0)),\"W\",\"E\")","v":"E"},null,{"$f":"T39+S40","v":253.87252352945109},null,null,null,{"$f":"X39+W40","v":258.94997400004007},null,{"$f":"IF(Y40=Y38,Z39+W40,W40)","v":0},{"$f":"IF(Y40=Y42,\"\",Z41)","v":""},280,null,"*"]
[null,null,null,null,null,null,null,null,{"$f":"CAP(C41,D41,F41,G41,C43,D43,F43,G43)","v":0},{"$f":"Distance1(C41,D41,F41,G41,C43,D43,F43,G43)","v":0},null,null,null,null,null,null,null,null,{"$f":"Distance2(M41,N41,P41,Q41,M43,N43,P43,Q43)","v":0},null,null,2,{"$f":"S42*(1+V42/100)","v":0},null,"SA"]
[null,{"$f":"B41+1","v":20},37,47.55,{"$f":"IF(OR(C43<0,AND(C43=0,D43<0)),\"S\",\"N\")","v":"N"},23,52.75,{"$f":"IF(OR(F43<0,AND(F43=0,G43<0)),\"W\",\"E\")","v":"E"},null,null,{"$f":"K41+J42","v":253.87698334067258},null,{"$f":"TRUNC(geoshiftlat(C43,D43,F43,G43),0)","v":37},{"$f":"(geoshiftlat(C43,D43,F43,G43)-M43)*60","v":47.610705665652091},{"$f":"IF(OR(M43<0,AND(M43=0,N43<0)),\"S\",\"N\")","v":"N"},{"$f":"TRUNC(geoshiftlon(C43,D43,F43,G43),0)","v":23},{"$f":"(geoshiftlon(C43,D43,F43,G43)-P43)*60","v":52.786346298072147},{"$f":"IF(OR(P43<0,AND(P43=0,Q43<0)),\"W\",\"E\")","v":"E"},null,{"$f":"T41+S42","v":253.87252352945109},null,null,null,{"$f":"X41+W42","v":258.94997400004007},null,{"$f":"IF(Y42=Y40,Z41+W42,W42)","v":0},{"$f":"IF(Y42=Y44,\"\",Z43)","v":""},300,null,"*"]
[null,null,null,null,null,null,null,null,{"$f":"CAP(C43,D43,F43,G43,C45,D45,F45,G45)","v":0},0,null,null,null,null,null,null,null,null,0,null,null,2,{"$f":"S44*(1+V44/100)","v":0},null,"SA"]
[null,{"$f":"B43+1","v":21},37,47.55,{"$f":"IF(OR(C45<0,AND(C45=0,D45<0)),\"S\",\"N\")","v":"N"},23,52.75,{"$f":"IF(OR(F45<0,AND(F45=0,G45<0)),\"W\",\"E\")","v":"E"},null,null,{"$f":"K43+J44","v":253.87698334067258},null,37,47.610705665652091,"N",23,52.786346298072147,"E",null,{"$f":"T43+S44","v":253.87252352945109},null,null,null,{"$f":"X43+W44","v":258.94997400004007},null,{"$f":"IF(Y44=Y42,Z43+W44,W44)","v":0},{"$f":"IF(Y44=Y46,\"\",Z45)","v":""},400,null,"*"]
[null,null,null,null,null,null,null,null,{"$f":"CAP(C45,D45,F45,G45,C47,D47,F47,G47)","v":0},0,null,null,null,null,null,null,null,null,0,null,null,2,{"$f":"S46*(1+V46/100)","v":0},null,"SA"]
[null,{"$f":"B45+1","v":22},37,47.55,{"$f":"IF(OR(C47<0,AND(C47=0,D47<0)),\"S\",\"N\")","v":"N"},23,52.75,{"$f":"IF(OR(F47<0,AND(F47=0,G47<0)),\"W\",\"E\")","v":"E"},null,null,{"$f":"K45+J46","v":253.87698334067258},null,37,47.610705665652091,"N",23,52.786346298072147,"E",null,{"$f":"T45+S46","v":253.87252352945109},null,null,null,{"$f":"X45+W46","v":258.94997400004007},null,{"$f":"IF(Y46=Y44,Z45+W46,W46)","v":0},{"$f":"IF(Y46=Y48,\"\",Z47)","v":0},700,null,"SA/LWA"]
[null,null,null,null,null,null,null,null,{"$f":"CAP(C47,D47,F47,G47,C49,D49,F49,G49)","v":0},0,null,null,null,null,null,null,null,null,0,null,null,2,{"$f":"S48*(1+V48/100)","v":0},null,"LWA"]
[null,{"$f":"B47+1","v":23},37,47.55,{"$f":"IF(OR(C49<0,AND(C49=0,D49<0)),\"S\",\"N\")","v":"N"},23,52.75,{"$f":"IF(OR(F49<0,AND(F49=0,G49<0)),\"W\",\"E\")","v":"E"},null,null,{"$f":"K47+J48","v":253.87698334067258},null,37,47.610705665652091,"N",23,52.786346298072147,"E",null,{"$f":"T47+S48","v":253.87252352945109},null,null,null,{"$f":"X47+W48","v":258.94997400004007},null,{"$f":"IF(Y48=Y46,Z47+W48,W48)","v":0},{"$f":"IF(Y48=Y50,\"\",Z49)","v":""},820,null,"*"]
[null,null,null,null,null,null,null,null,{"$f":"CAP(C49,D49,F49,G49,C51,D51,F51,G51)","v":0},{"$f":"Distance1(C49,D49,F49,G49,C51,D51,F51,G51)","v":0},null,null,null,null,null,null,null,null,{"$f":"Distance2(M49,N49,P49,Q49,M51,N51,P51,Q51)","v":0},null,null,2,{"$f":"S50*(1+V50/100)","v":0},null,"LWA"]
[null,{"$f":"B49+1","v":24},37,47.55,{"$f":"IF(OR(C51<0,AND(C51=0,D51<0)),\"S\",\"N\")","v":"N"},23,52.75,{"$f":"IF(OR(F51<0,AND(F51=0,G51<0)),\"W\",\"E\")","v":"E"},null,null,{"$f":"K49+J50","v":253.87698334067258},null,37,47.610705665652091,"N",23,52.786346298072147,"E",null,{"$f":"T49+S50","v":253.87252352945109},null,null,null,{"$f":"X49+W50","v":258.94997400004007},null,{"$f":"IF(Y50=Y48,Z49+W50,W50)","v":0},{"$f":"IF(Y50=Y52,\"\",Z51)","v":""},850,null,"Crossing"]
[null,null,null,null,null,null,null,null,{"$f":"CAP(C51,D51,F51,G51,C53,D53,F53,G53)","v":0},{"$f":"Distance1(C51,D51,F51,G51,C53,D53,F53,G53)","v":0},null,null,null,null,null,null,null,null,{"$f":"Distance2(M51,N51,P51,Q51,M53,N53,P53,Q53)","v":0},null,null,2,{"$f":"S52*(1+V52/100)","v":0},null,"LWA"]
[null,{"$f":"B51+1","v":25},37,47.55,{"$f":"IF(OR(C53<0,AND(C53=0,D53<0)),\"S\",\"N\")","v":"N"},23,52.75,{"$f":"IF(OR(F53<0,AND(F53=0,G53<0)),\"W\",\"E\")","v":"E"},null,null,{"$f":"K51+J52","v":253.87698334067258},null,{"$f":"TRUNC(geoshiftlat(C53,D53,F53,G53),0)","v":37},{"$f":"(geoshiftlat(C53,D53,F53,G53)-M53)*60","v":47.610705665652091},{"$f":"IF(OR(M53<0,AND(M53=0,N53<0)),\"S\",\"N\")","v":"N"},{"$f":"TRUNC(geoshiftlon(C53,D53,F53,G53),0)","v":23},{"$f":"(geoshiftlon(C53,D53,F53,G53)-P53)*60","v":52.786346298072147},{"$f":"IF(OR(P53<0,AND(P53=0,Q53<0)),\"W\",\"E\")","v":"E"},null,{"$f":"T51+S52","v":253.87252352945109},null,null,null,{"$f":"X51+W52","v":258.94997400004007},null,{"$f":"IF(Y52=Y50,Z51+W52,W52)","v":0},{"$f":"IF(Y52=Y54,\"\",Z53)","v":""},880,null,"*"]
[null,null,null,null,null,null,null,null,{"$f":"CAP(C53,D53,F53,G53,C55,D55,F55,G55)","v":0},{"$f":"Distance1(C53,D53,F53,G53,C55,D55,F55,G55)","v":0},null,null,null,null,null,null,null,null,{"$f":"Distance2(M53,N53,P53,Q53,M55,N55,P55,Q55)","v":0},null,null,2,{"$f":"S54*(1+V54/100)","v":0},null,"LWA"]
[null,{"$f":"B53+1","v":26},37,47.55,{"$f":"IF(OR(C55<0,AND(C55=0,D55<0)),\"S\",\"N\")","v":"N"},23,52.75,{"$f":"IF(OR(F55<0,AND(F55=0,G55<0)),\"W\",\"E\")","v":"E"},null,null,{"$f":"K53+J54","v":253.87698334067258},null,{"$f":"TRUNC(geoshiftlat(C55,D55,F55,G55),0)","v":37},{"$f":"(geoshiftlat(C55,D55,F55,G55)-M55)*60","v":47.610705665652091},{"$f":"IF(OR(M55<0,AND(M55=0,N55<0)),\"S\",\"N\")","v":"N"},{"$f":"TRUNC(geoshiftlon(C55,D55,F55,G55),0)","v":23},{"$f":"(geoshiftlon(C55,D55,F55,G55)-P55)*60","v":52.786346298072147},{"$f":"IF(OR(P55<0,AND(P55=0,Q55<0)),\"W\",\"E\")","v":"E"},null,{"$f":"T53+S54","v":253.87252352945109},null,null,null,{"$f":"X53+W54","v":258.94997400004007},null,{"$f":"IF(Y54=Y52,Z53+W54,W54)","v":0},{"$f":"IF(Y54=Y56,\"\",Z55)","v":0},1000,null,"LWA/LWP"]
[null,null,null,null,null,null,null,null,{"$f":"CAP(C55,D55,F55,G55,C57,D57,F57,G57)","v":0},{"$f":"Distance1(C55,D55,F55,G55,C57,D57,F57,G57)","v":0},null,null,null,null,null,null,null,null,{"$f":"Distance2(M55,N55,P55,Q55,M57,N57,P57,Q57)","v":0},null,null,3,{"$f":"S56*(1+V56/100)","v":0},null,"LWP"]
[null,{"$f":"B55+1","v":27},37,47.55,{"$f":"IF(OR(C57<0,AND(C57=0,D57<0)),\"S\",\"N\")","v":"N"},23,52.75,{"$f":"IF(OR(F57<0,AND(F57=0,G57<0)),\"W\",\"E\")","v":"E"},null,null,{"$f":"K55+J56","v":253.87698334067258},null,37,47.610705665652091,{"$f":"IF(OR(M57<0,AND(M57=0,N57<0)),\"S\",\"N\")","v":"N"},23,52.786346298072147,"E",null,{"$f":"T55+S56","v":253.87252352945109},null,null,null,{"$f":"X55+W56","v":258.94997400004007},null,{"$f":"IF(Y56=Y54,Z55+W56,W56)","v":0},{"$f":"IF(Y56=Y58,\"\",Z57)","v":""},1050,null,"*"]
[null,null,null,null,null,null,null,null,{"$f":"CAP(C57,D57,F57,G57,C59,D59,F59,G59)","v":0},{"$f":"Distance1(C57,D57,F57,G57,C59,D59,F59,G59)","v":0},null,null,null,null,null,null,null,null,{"$f":"Distance2(M57,N57,P57,Q57,M59,N59,P59,Q59)","v":0},null,null,3,0,null,"LWP"]
[null,{"$f":"B57+1","v":28},37,47.55,{"$f":"IF(OR(C59<0,AND(C59=0,D59<0)),\"S\",\"N\")","v":"N"},23,52.75,{"$f":"IF(OR(F59<0,AND(F59=0,G59<0)),\"W\",\"E\")","v":"E"},null,null,{"$f":"K57+J58","v":253.87698334067258},null,37,47.610705665652091,"N",23,52.786346298072147,"E",null,{"$f":"T57+S58","v":253.87252352945109},null,null,null,{"$f":"X57+W58","v":258.94997400004007},null,{"$f":"IF(Y58=Y56,Z57+W58,W58)","v":0},{"$f":"IF(Y58=Y60,\"\",Z59)","v":""},1020,null,"Crossing"]
[null,null,null,null,null,null,null,null,{"$f":"CAP(C59,D59,F59,G59,C61,D61,F61,G61)","v":0},{"$f":"Distance1(C59,D59,F59,G59,C61,D61,F61,G61)","v":0},null,null,null,null,null,null,null,null,{"$f":"Distance2(M59,N59,P59,Q59,M61,N61,P61,Q61)","v":0},null,null,3,0,null,"LWP"]
[null,{"$f":"B59+1","v":29},37,47.55,{"$f":"IF(OR(C61<0,AND(C61=0,D61<0)),\"S\",\"N\")","v":"N"},23,52.75,{"$f":"IF(OR(F61<0,AND(F61=0,G61<0)),\"W\",\"E\")","v":"E"},null,null,{"$f":"K59+J60","v":253.87698334067258},null,37,47.610705665652091,"N",23,52.786346298072147,"E",null,{"$f":"T59+S60","v":253.87252352945109},null,null,null,{"$f":"X59+W60","v":258.94997400004007},null,{"$f":"IF(Y60=Y58,Z59+W60,W60)","v":0},{"$f":"IF(Y60=Y62,\"\",Z61)","v":""},1050,null,"Crossing"]
[null,null,null,null,null,null,null,null,{"$f":"CAP(C61,D61,F61,G61,C63,D63,F63,G63)","v":0},{"$f":"Distance1(C61,D61,F61,G61,C63,D63,F63,G63)","v":0},null,null,null,null,null,null,null,null,{"$f":"Distance2(M61,N61,P61,Q61,M63,N63,P63,Q63)","v":0},null,null,3,0,null,"LWP"]
[null,{"$f":"B61+1","v":30},37,47.55,{"$f":"IF(OR(C63<0,AND(C63=0,D63<0)),\"S\",\"N\")","v":"N"},23,52.75,{"$f":"IF(OR(F63<0,AND(F63=0,G63<0)),\"W\",\"E\")","v":"E"},null,null,{"$f":"K61+J62","v":253.87698334067258},null,37,47.610705665652091,"N",23,52.786346298072147,"E",null,{"$f":"T61+S62","v":253.87252352945109},null,null,null,{"$f":"X61+W62","v":258.94997400004007},null,{"$f":"IF(Y62=Y60,Z61+W62,W62)","v":0},{"$f":"IF(Y62=Y64,\"\",Z63)","v":0},1000,null,"LWP/LWA"]
[null,null,null,null,null,null,null,null,{"$f":"CAP(C63,D63,F63,G63,C65,D65,F65,G65)","v":0},{"$f":"Distance1(C63,D63,F63,G63,C65,D65,F65,G65)","v":0},null,null,null,null,null,null,null,null,{"$f":"Distance2(M63,N63,P63,Q63,M65,N65,P65,Q65)","v":0},null,null,2,0,null,"LWA"]
[null,{"$f":"B63+1","v":31},37,47.55,{"$f":"IF(OR(C65<0,AND(C65=0,D65<0)),\"S\",\"N\")","v":"N"},23,52.75,{"$f":"IF(OR(F65<0,AND(F65=0,G65<0)),\"W\",\"E\")","v":"E"},null,null,{"$f":"K63+J64","v":253.87698334067258},null,37,47.610705665652091,"N",23,52.786346298072147,"E",null,{"$f":"T63+S64","v":253.87252352945109},null,null,null,{"$f":"X63+W64","v":258.94997400004007},null,{"$f":"IF(Y64=Y62,Z63+W64,W64)","v":0},{"$f":"IF(Y64=Y66,\"\",Z65)","v":0},700,null,"LWA/SA"]
[null,null,null,null,null,null,null,null,{"$f":"CAP(C65,D65,F65,G65,C67,D67,F67,G67)","v":0},{"$f":"Distance1(C65,D65,F65,G65,C67,D67,F67,G67)","v":0},null,null,null,null,null,null,null,null,{"$f":"Distance2(M65,N65,P65,Q65,M67,N67,P67,Q67)","v":0},null,null,2,0,null,"SA"]
[null,{"$f":"B65+1","v":32},37,47.55,{"$f":"IF(OR(C67<0,AND(C67=0,D67<0)),\"S\",\"N\")","v":"N"},23,52.75,{"$f":"IF(OR(F67<0,AND(F67=0,G67<0)),\"W\",\"E\")","v":"E"},null,null,{"$f":"K65+J66","v":253.87698334067258},null,37,47.610705665652091,"N",23,52.786346298072147,"E",null,{"$f":"T65+S66","v":253.87252352945109},null,null,null,{"$f":"X65+W66","v":258.94997400004007},null,{"$f":"IF(Y66=Y64,Z65+W66,W66)","v":0},{"$f":"IF(Y66=Y68,\"\",Z67)","v":""},200,null,"*"]
[null,null,null,null,null,null,null,null,{"$f":"CAP(C67,D67,F67,G67,C69,D69,F69,G69)","v":0},{"$f":"Distance1(C67,D67,F67,G67,C69,D69,F69,G69)","v":0},null,null,null,null,null,null,null,null,{"$f":"Distance2(M67,N67,P67,Q67,M69,N69,P69,Q69)","v":0},null,null,2,{"$f":"S68*(1+V68/100)","v":0},null,"SA"]
[null,{"$f":"B67+1","v":33},37,47.55,{"$f":"IF(OR(C69<0,AND(C69=0,D69<0)),\"S\",\"N\")","v":"N"},23,52.75,{"$f":"IF(OR(F69<0,AND(F69=0,G69<0)),\"W\",\"E\")","v":"E"},null,null,{"$f":"K67+J68","v":253.87698334067258},null,37,47.610705665652091,"N",23,52.786346298072147,"E",null,{"$f":"T67+S68","v":253.87252352945109},null,null,null,{"$f":"X67+W68","v":258.94997400004007},null,{"$f":"IF(Y68=Y66,Z67+W68,W68)","v":0},{"$f":"IF(Y68=Y70,\"\",Z69)","v":0},100,null,"SA/DA"]
[null,null,null,null,null,null,null,null,{"$f":"CAP(C69,D69,F69,G69,C71,D71,F71,G71)","v":0},{"$f":"Distance1(C69,D69,F69,G69,C71,D71,F71,G71)","v":0},null,null,null,null,null,null,null,null,{"$f":"Distance2(M69,N69,P69,Q69,M71,N71,P71,Q71)","v":0},null,null,2,{"$f":"S70*(1+V70/100)","v":0},null,"DA"]
[null,{"$f":"B69+1","v":34},37,47.55,{"$f":"IF(OR(C71<0,AND(C71=0,D71<0)),\"S\",\"N\")","v":"N"},23,52.75,{"$f":"IF(OR(F71<0,AND(F71=0,G71<0)),\"W\",\"E\")","v":"E"},null,null,{"$f":"K69+J70","v":253.87698334067258},null,{"$f":"TRUNC(geoshiftlat(C71,D71,F71,G71),0)","v":37},{"$f":"(geoshiftlat(C71,D71,F71,G71)-M71)*60","v":47.610705665652091},{"$f":"IF(OR(M71<0,AND(M71=0,N71<0)),\"S\",\"N\")","v":"N"},{"$f":"TRUNC(geoshiftlon(C71,D71,F71,G71),0)","v":23},{"$f":"(geoshiftlon(C71,D71,F71,G71)-P71)*60","v":52.786346298072147},{"$f":"IF(OR(P71<0,AND(P71=0,Q71<0)),\"W\",\"E\")","v":"E"},null,{"$f":"T69+S70","v":253.87252352945109},null,null,null,{"$f":"X69+W70","v":258.94997400004007},null,{"$f":"IF(Y70=Y68,Z69+W70,W70)","v":0},{"$f":"IF(Y70=Y72,\"\",Z71)","v":0},0,null,"Canea"]

{"sheet":"Spheroides","index":5,"n_rows":56,"n_cols":8,"rows_kept":56,"cut":false,"hidden":false,"merged":[]}
["Liste des Ellipsoides Disponibles"]
[]
[]
[]
[]
[]
[null,null,"Nom","Demi Grand","Demi Petit","e2","n","1 / f"]
[null,1,"AIRY",6377563.3959999997,6356256.909,{"$f":"POWER(1/D8*(SQRT((D8*D8)-(E8*E8))),2)","v":6.6705400741490836E-3},1.6732202503250534E-3,{"$f":"1/((D8-E8)/D8)","v":299.32496126649505}]
[null,2,"AIRY MOD",6377340.1890000002,6356034.4479999999,6.6705399807736503E-3,1.6732203054869081E-3,299.32496546352854]
[null,3,"AUSTRALIAN NATIONAL 1967/84",6378160,6356774.7189999996,6.694541915624532E-3,null,298.24999727615801]
[null,4,"BESSEL 1841",6377397.1550000003,6356078.9630000005,6.6743721749749326E-3,1.6741847868128074E-3,299.15281535132334]
[null,5,"BESSEL 1841 MOD",6377483.8650000002,6356165.3830000004,6.6743722212770787E-3,1.6741847984660181E-3,299.15281327254201]
[null,6,"BESSEL NGO",6377492.0180000002,6356173.5089999996,6.6743721420039794E-3,null,299.152816831601]
[null,7,"BESSEL RD / POTSDAM",6377397.1550000003,6356078.9630000005,6.6743721749749326E-3,null,299.15281535132334]
[null,8,"BROADCAST",6378135,6356750.5199999996,6.6943177832963279E-3,null,298.25999977553192]
[null,9,"CLARKE 1856",6378235.5999999996,6356560.1399999997,6.785145919996286E-3,null,294.26068005015861]
[null,10,"CLARKE 1866",6378206.4000000004,6356583.7999999998,6.7686579972911819E-3,1.6979156829769022E-3,294.97869821389821]
[null,11,"CLARKE 1880",6378249.1449999996,6356514.8700000001,6.8035111421552033E-3,1.7066884768653044E-3,293.46500607911531]
[null,12,"CLARKE 1880 IGN",6378249.2000000002,6356515,6.8034876462998934E-3,null,293.46602129362691]
[null,13,"CLARKE 1880 MOD",6378249.1449999996,6356514.8700000001,6.8035111421552033E-3,1.7066884768653044E-3,293.46500607911531]
[null,14,"CLARKE 1880 (PALESTINE)",6378300.7819999997,6356566.4270000001,6.803481156342152E-3,null,293.46630171450414]
[null,15,"DANISH 1876  / ANDRAE",6377104.4299999997,6355847.415,6.6555556284901502E-3,null,299.99999670697417]
[null,16,"EVEREST (INDE) METRIQUE",6377301.2429999998,6356100.2300000004,6.6378461201175376E-3,null,300.80172315352098]
[null,17,"EVEREST (MALAYA)",6377295.6639999999,6356094.6679999996,6.637846603695206E-3,null,300.80170120309049]
[null,18,"EVEREST 1830",6377276.3449999997,6356075.4129999997,6.6378466740345783E-3,1.6649922505031004E-3,300.80169801025681]
[null,19,"EVEREST 1830 (MOD.)",6377298.5609999998,6356097.5549999997,6.6378467190551368E-3,null,300.80169596669066]
[null,20,"EVEREST BORNEO",6377298.5559999999,6356097.5549999997,6.6378451614016471E-3,null,300.80176667129774]
[null,21,"EVEREST MOD.",6377304.0630000001,6356103.0389999999,6.6378466280601449E-3,null,300.80170009712441]
[null,22,"FISHER 1960 (MERCURY)",6378166,6356784.284,6.6934215001796154E-3,null,298.30000548131846]
[null,23,"FISHER 1968",6378150,6356768.3370000003,6.6934216993408307E-3,null,298.29999659054056]
[null,24,"FISCHER MOD",6378160,6356774.7189999996,6.694541915624532E-3,1.6792611404669755E-3,298.24999727615801]
[null,25,"FISHER MOD. 1960",6378155,6356773.3200000003,6.6934217738298723E-3,null,298.29999326526678]
[null,26,"GRS 67",6378160,6356774.5159999998,6.694605356917795E-3,null,298.24716616186703]
[null,27,"GRS 80",6378137,6356752.3140000002,6.6943800667646578E-3,null,298.25722014342756]
[null,28,"HELMERT 1906",6378200,6356818,6.6934746345492999E-3,1.6789925228217189E-3,298.29763352352444]
[null,29,"HOUGH",6378270,6356794.3430000003,6.7226701580694282E-3,1.6863406749730355E-3,296.99999399320365]
[null,30,"INTERNATIONAL",6378388,6356911.9460000005,6.7226700623166684E-3,1.6863406508729228E-3,296.9999982305938]
[null,31,"JEFFREYS 1948",6378099,6356631,6.7204571463943836E-3,null,297.09795975405251]
[null,32,"KRASSOVSKY",6378245,6356863,6.6934274898192208E-3,1.6789806572508061E-3,298.29973809746514]
[null,33,"PRECISE",6378145,6356759.7690000003,6.6945420073107756E-3,1.6792611635429559E-3,298.2499931845532]
[null,34,"REF ELLIPSOIDE 1967",6378160,6356774.7189999996,6.694541915624532E-3,1.6792611404669755E-3,298.24999727615801]
[null,35,"S AMERICA 1969",6378160,6356774.7189999996,6.694541915624532E-3,1.6792611404669755E-3,298.24999727615801]
[null,36,"STRUVE 1860",6378298.2999999998,6356657.1430000002,6.7743596975477745E-3,null,294.73000450022613]
[null,37,"SVANBERG",6376797,6355837.9709999999,6.5627258654816379E-3,null,304.25059290675966]
[null,38,"WAR OFFICE 1924",6378300,6356751.6890000002,6.7453433754114476E-3,null,295.99999740119182]
[null,39,"WGS 60",6378165,6356783.2869999995,6.6934216102894064E-3,null,298.30000056589779]
[null,40,"WGS 66",6378145,6356759.7690000003,6.6945420073107756E-3,null,298.2499931845532]
[null,41,"WGS 72",6378135,6356750.5199999996,6.6943177832963279E-3,1.6792047299063939E-3,298.25999977553192]
[null,42,"WGS 84",6378137,6356752.3140000002,6.6943800667646578E-3,1.6792204056685965E-3,298.25722014342756]
[null,43]
[null,44]
[null,45]
[null,46]
[]
[]
[null,null," "]

{"sheet":"Table Datum Shifts","index":6,"n_rows":203,"n_cols":186,"rows_kept":203,"cut":false,"hidden":false,"merged":[]}
["Datum System 1",null,"\"-0231,00;-0196,00;+0482,00;-0,000;-0,000;-0,000;-0,000\""]
["Datum System 2",null,"\"-0084,00;-0095,00;-0130,00;-0,000;-0,000;-0,000;-0,000\""]
[null,null,{"$f":"MID(C1,2,8)","v":"-0231,00"},{"$f":"MID(C1,11,8)","v":"-0196,00"},{"$f":"MID(C1,20,8)","v":"+0482,00"},{"$f":"MID(C1,29,6)","v":"-0,000"},{"$f":"MID(C1,36,6)","v":"-0,000"},{"$f":"MID(C1,43,6)","v":"-0,000"},{"$f":"MID(C1,50,6)","v":"-0,000"}]
[null,null,{"$f":"MID(C2,2,8)","v":"-0084,00"},{"$f":"MID(C2,11,8)","v":"-0095,00"},{"$f":"MID(C2,20,8)","v":"-0130,00"},{"$f":"MID(C2,29,6)","v":"-0,000"},{"$f":"MID(C2,36,6)","v":"-0,000"},{"$f":"MID(C2,43,6)","v":"-0,000"},{"$f":"MID(C2,50,6)","v":"-0,000"}]
[null,null,{"$f":"C3-C4","v":-147},-101,612,0,0,0,0]
[null,null,{"$f":"ABS(C5)","v":147},101,612,0,0,0,0]
[null,null,{"$f":"TEXT(C6,\"0000,00\")","v":"0147,00"},{"$f":"TEXT(D6,\"0000,00\")","v":"0101,00"},{"$f":"TEXT(E6,\"0000,00\")","v":"0612,00"},{"$f":"TEXT(F6,\"0,000\")","v":"0,000"},{"$f":"TEXT(G6,\"0,000\")","v":"0,000"},{"$f":"TEXT(H6,\"0,000\")","v":"0,000"},{"$f":"TEXT(I6,\"0,000\")","v":"0,000"}]
[null,null,{"$f":"IF(C5>0,CONCATENATE(\"+\",C7),CONCATENATE(\"-\",C7))","v":"-0147,00"},"-0101,00","+0612,00","-0,000","-0,000","-0,000","-0,000"]
[null,null,{"$f":"CONCATENATE(\"\"\"\",C8,\";\")","v":"\"-0147,00;"},{"$f":"CONCATENATE(D8,\";\")","v":"-0101,00;"},{"$f":"CONCATENATE(E8,\";\")","v":"+0612,00;"},{"$f":"CONCATENATE(F8,\";\")","v":"-0,000;"},{"$f":"CONCATENATE(G8,\";\")","v":"-0,000;"},{"$f":"CONCATENATE(H8,\";\")","v":"-0,000;"},{"$f":"CONCATENATE(I8,\"\"\"\")","v":"-0,000\""}]
["Datum Calcule",null,{"$f":"CONCATENATE(C9,D9,E9,F9,G9,H9,I9)","v":"\"-0147,00;-0101,00;+0612,00;-0,000;-0,000;-0,000;-0,000\""}]
[]
[null,null,null,"Vers","Vers","Vers","Vers","Vers","Vers","Vers","Vers","Vers","Vers","Vers","Vers","Vers","Vers","Vers","Vers","Vers","Vers","Vers","Vers","Vers",null,"Vers","Vers","Vers","Vers",null,"Vers","Vers","Vers","Vers",null,"Vers","Vers","Vers","Vers","Vers",null,"Vers","Vers","Vers","Vers",null,"Vers","Vers","Vers","Vers","Vers","Vers",null,"Vers","Vers","Vers","Vers","Vers","Vers","Vers","Vers","Vers",null,"Vers",null,"Vers",null,null,null,null,"Vers",null,null,"Vers",null,"Vers",null,"Vers","Vers","Vers",null,"Vers","Vers","Vers","Vers",null,"Vers","Vers","Vers","Vers",null,"Vers","Vers",null,null,null,"Vers","Vers","Vers","Vers","Vers","Vers",null,"Vers",null,null,null,"Vers","Vers","Vers","Vers","Vers",null,null,null,"Vers",null,"Vers","Vers","Vers","Vers","Vers","Vers","Vers","Vers","Vers","Vers","Vers","Vers","Vers","Vers","Vers","Vers","Vers",null,"Vers","Vers","Vers","Vers","Vers",null,"Vers","Vers","Vers","Vers","Vers","Vers","Vers",null,"Vers","Vers","Vers",null,"Vers","Vers","Vers","Vers","Vers","Vers","Vers","Vers","Vers","Vers","Vers","Vers","Vers","Vers","Vers","Vers","Vers",null,"Vers","Vers","Vers","Vers","Vers","Vers","Vers","Vers","Vers","Vers","Vers","Vers","Vers"]
[null,null,"Zone / Datum","Monde / WGS84","Afrique du Sud / S Africa Cape","Alaska / NAD27","Alaska / NAD27","Alaska / NAD83","Amerique Central / NAD83","Arabie Saoudite / Nahrwan","Argentine / Campo Inchauste","Argentine / S. America 1969","Australie / Australian Geodetic 1966","Australie / Australian Nat","Australie / Autralian","Bahrain / Ain El Abl 1970","Bangladesh / Indian","Belize / NAD27","Bolivie / Prov. S America 1956","Bolivie / S. America 1969","Botswana / Cape Arc 1950","Bresil / S. America 1969","Brunei / Timbalai","Canada / NAD27","Canada / NAD27 (Canada)","Canal Panama / NAD27","Chili / Prov. S Chilean 63","Chili / S. America 1969","Chypre / ED50","Colombie / Bogota Observatory","Colombie / Prov. S America 1956","Colombie / S. America 1969","Corée / Tokyo","Egypte / ED50","Egypte / Old Egyptian","Emirats Arabes Unifies / Nahrwan","Equateur / Prov. S American 1956","Equateur / S American 1969","Erytree / Massawa","Espagne / ED50","Espiranto Santos / Santo (DOS)","Ethiopie / Adindan","Europe / ED50","Europe / ED87","Finlande / ED50","France / ED50 IGN","France / ED79 France","France / IGN/NTF","France / WGS72 France","Gabon / M'Paraloko","Gizo / Gizo DOS 1968","Grece / ED50","Groenland / NAD27","Groenland / Qornoq","Guatemala / NAD27","Guyana / Prov. S American 1956","Guyana / S American 1969","Honduras / NAD27","Hong Kong / Hong Kong 1963","Icelande / Hjorsey 1955","Ile d'Efate et Erromango / Bellevue (IGN)","Ile d'Oahu / ?","Ile de Costa Rica / NAD27","Ile de Cuba / NAD27","Ile de Guam / Guam 1963","Ile de Kerguelen / Kerguelen","Ile de l'Ascension / Ascension 1958","Ile de la Barbades / NAD27","Ile de la Jamaique / NAD27","Ile de Madere / SE Base","Ile de Sao Miguel / Sao Braz","Ile de Sardaigne / ED50","Ile de Sardaigne / Rome 1940","Ile de Sicile / ED50","Ile de Tern / Asrto B4","Ile Diego Garcia / ISTS 073 Astro 1969","Ile Dominique / NAD27","Ile Georgia / DOS 1968","Ile Grand Cayman / NAD27","Ile Guadalcanal / Gux 1 Astro","Ile Hawaii / Old Hawaiian","Ile Hawaii Kauai / Old Hawaiian","Ile Hawaii Maui / Old Hawaiian","Ile Hawaii Oahu / Old Hawaiian","Ile Iwo Jima / Astro Beacon East","Ile Johnson / Johnson Is 1961","Ile Mahe / Ile Mahe 1971","Ile Marcus / Asrto Stn 1952","Ile Pitcairn / Pitcairn Astro 1967","Ile Saint Helene / Astro DOS 7","Ile Santa Maria / Sao Braz","Ile Tristan da Cunha / Tristan Astro","Ile Viti Levu / Viti Levu 1916","Iles Bahamas / Cape Canaveral","Iles Bahamas / NAD27","Iles Caicos / NAD27","Iles Caiman / LC 5 Astro","Iles Canaries / Pico de las Nieves","Iles Chatam / Ile Chatam 1971","Iles Cocos / Australian","Iles de Mascarenes / Reunion","Iles de Midway / Midway Astro 1961","Iles de Paques / Iles de Paques 1967","Iles des Açores / Observatorio 1966","Iles des Açores / SW Base","Iles des Bermudes / Bermuda 1957","Iles Falklands / Sapper Hill 1943","Iles Maldives / Gandajika Base","Iles Marshall / Wake Eniwetok 1960","Iles Phoenix / Canton Astro 1966","Iles Salvages / Marco Astro","Iles Sous le Vent / NAD27","Iles Trinité & Tobago / Naparima (BWI)","Iles Trinité & Tobago / S. American 1969","Iles Vierges / Puerto Rico","Iran / ED50","Irelande / Ireland 1965","Japon / Tokyo","Kenya / Cape Arc 1950","Lesoto / Cape Arc 1950","Liberia / Liberia 1964","Malaisie (Est) / Timbalia","Malaisie (Ouest) / Kertau 1948","Malawi / Cape Arc 1950","Mali / Adindan","Maroc / Merchich","Maui / Maui","Mexique / NAD27","Mindanao / Luzon","Monde / DOPLER","Monde / NWL 10D","Monde / NWL 9D","Monde / WGS 72","Monde / WGS84 SEA","Namibie / Schwarzeck","Neherlandes / RD","Nepal / Indian","Nicaragua / NAD27","Nigeria / Minna","Norvège / ED50","Nouvelles Zelandes / GD 1949","Oman / Oman","Paraguay / Chua Astro","Paraguay / S American 1969","Perou / Prov S American 1956","Perou / S American 1969","Phillipines / Luzon 1911","Portugal / ED50","Puerto Rico / Puerto Rico","Qatar / Nahrwan","Qatar / Nahrwan Maersk","Qatar / Qatar National","Royaume Uni / DOPPLER","Royaume Uni / ED50","Royaume Uni / OS(SN)80","Russie / Pulkovo","Russie / WGS72","Sabah / Timbalai 1948","San Salvador / NAD27","Sarawak / Timbalai 1948","Senegal / Adindan","Singapour / Kertau 1948","Singapour / Kertau 1948","Singapour / South Asia","Somalie / Afgooye","Soudan / Adindan","Sri Lanka / Kandawala","Sumatra / Djakarta (Batavia)","Surinam / Zanderij","Swaziland / Cape Arc 1950","Tanzanie / Cale Arc 1950","Tasmanie / Australian National","Thailande / Indian","Thailande / Moattama","Tunisie / Carthage","Turquie / NAD27","USA / NAD27 (CONUS)","Venezuela / Prov. S. American 1956","Venezuela / S. American 1969","Vietnam / Indian","Zaire / Cape Arc 1950","Zambie / Cape Arc 1950","Zimbabwe / Cape Arc 1950"," / "," / "," / "]
[null,"Zone / Datum","Spheroide","WGS84","Clarke 1880 Mod.","Clarke 1866","Clarke 1866","GRS80","GRS80","Clarke 1880 Mod.","International","S America 1969","RE 1967","RE 1967","RE 1984","International","Everest 1830","Clarke 1866","International","S. America 1969","Clarke 1880 Mod.","S. America 1969","Everest 1830","Clarke 1866","Clarke 1866","Clarke 1866","International","S. America 1969","International","International","International","S. America 1969","Bessel 1841","International","Helmert 1906","Clarke 1880 Mod","International","S American 1969","Bessel 1841","International","International","Clarke 1880 Mod","International","International","International","International","International","Clarke 1880 (IGN)","WGS72","Clarke 1880","International","International","Clarke 1866","International","Clarke 1866","International","S American","Clarke 1866","International","International","International","Clarke 1866","Clarke 1866","Clarke 1866","Clarke 1966","International","International","Clarke 1866","Clarke 1866","International","International","International","International","International","International","International","Clarke 1866","International","Clarke 1866","International","Clarke 1866","Clarke 1866","Clarke 1866","Clarke 1866","International","International","Clarke 1880 Mod","International","International","International","International","International","Clarke 1880 Mod","Clarke 1866","Clarke 1866","Clarke 1866","Clarke 1866","International","International","RE 1967","International","International","International","International","International","Clarke 1866","International","International","Hough","International","International","Clarke 1866","International","S. American 1969","Clarke 1866","International","Airy Mod","Bessel 1841","Clarke 1880 Mod","Clarke 1880 Mod","Clarke 1880 Mod","Everest 1830","Everest Mod","Clarke 1880 Mod","Clarke 1880 Mod","Clarke 1880 Mod","Clarke 1866","Clarke 1866","Clarke 1866","Precise","NWL 10D","NWL 9D","WGS 72","WGS84","Bessel 1841 Mod","Bessel RD","Everst 1830","Clarke 1866","Clarke 1880 Mod","International","International","Clarke 1880 Mod","International","S American 1969","International","S American 1969","Clarke 1866","International","Clarke 1866","Clarke 1880 Mod","Clarke 1880 Mod","International","Precise","International","Airy","Krassovsky","WGS72","Everest 1830","Clarke 1866","Everst 1830","Clarke 1880 Mod","Everest Mod","Everest 1830","Fisher Mod","Krassovsky","Clarke 1880 Mod","Everest 1830","Bessel 1841","International","Clarke 1880 Mod","Clarke 1880 Mod","RE 1967","Everest 1830","WGS84","Clarke 1880 Mod","Clarke 1866","Clarke 1866","International","S. American 1969","Everest 1830","Clarke 1880 Mod","Clarke 1880 Mod","Clarke 1880 Mod"]
["Depuis","Monde / WGS84","WGS84","\"-0000,00;-0000,00;-0000,00;-0,000;-0,000;-0,000;-0,000\"","\"+0136,00;+0108,00;+0292,00;-0,000;-0,000;-0,000;-0,000\"","\"+0012,62;-0156,56;-0180,52;-0,000;-0,000;-0,814;-0,427\"","\"+0005,00;-0135,00;-0172,00;-0,000;-0,000;-0,000;-0,000\"","\"-0000,00;-0000,00;-0000,00;-0,000;-0,000;-0,000;-0,000\"","\"-0000,00;-0000,00;-0000,00;-0,000;-0,000;-0,000;-0,000\"","\"+0231,00;+0196,00;-0482,00;-0,000;-0,000;-0,000;-0,000\"","\"+0148,00;-0136,00;-0090,00;-0,000;-0,000;-0,000;-0,000\"","\"+0057,00;-0001,00;+0041,00;-0,000;-0,000;-0,000;-0,000\"","\"+0133,00;+0048,00;-0148,00;-0,000;-0,000;-0,000;-0,000\"","\"+0122,00;+0041,00;-0150,00;-0,000;-0,000;-0,554;-0,227\"","\"+0134,00;+0048,00;-0149,00;-0,000;-0,000;-0,000;-0,000\"","\"+0150,00;+0251,00;+0002,00;-0,000;-0,000;-0,000;-0,000\"","\"-0289,00;-0734,00;-0257,00;-0,000;-0,000;-0,000;-0,000\"","\"-0000,00;-0125,00;-0194,00;-0,000;-0,000;-0,000;-0,000\"","\"+0288,00;-0175,00;+0376,00;-0,000;-0,000;-0,000;-0,000\"","\"+0057,00;-0001,00;+0041,00;-0,000;-0,000;-0,000;-0,000\"","\"+0138,00;+0105,00;+0289,00;-0,000;-0,000;-0,000;-0,000\"","\"+0057,00;-0001,00;+0041,00;-0,000;-0,000;-0,000;-0,000\"","\"+0689,00;-0691,00;+0046,00;-0,000;-0,000;-0,000;-0,000\"","\"+0010,00;-0158,00;-0187,00;-0,000;-0,000;-0,000;-0,000\"","\"+0009,00;-0139,00;-0177,50;-0,000;-0,000;-0,554;-0,227\"","\"-0000,00;-0125,00;-0201,00;-0,000;-0,000;-0,000;-0,000\"","\"-0016,00;-0196,00;-0093,00;-0,000;-0,000;-0,000;-0,000\"","\"+0057,00;-0001,00;+0041,00;-0,000;-0,000;-0,000;-0,000\"","\"+0104,00;+0101,00;+0140,00;-0,000;-0,000;-0,000;-0,000\"","\"-0307,00;-0304,00;+0318,00;-0,000;-0,000;-0,000;-0,000\"","\"+0288,00;-0175,00;+0376,00;-0,000;-0,000;-0,000;-0,000\"","\"+0057,00;-0001,00;+0041,00;-0,000;-0,000;-0,000;-0,000\"","\"+0128,00;-0481,00;-0664,00;-0,000;-0,000;-0,000;-0,000\"","\"+0130,00;+0117,00;+0151,00;-0,000;-0,000;-0,000;-0,000\"","\"+0130,00;-0110,00;+0013,00;-0,000;-0,000;-0,000;-0,000\"","\"+0249,00;+0156,00;-0381,00;-0,000;-0,000;-0,000;-0,000\"","\"+0288,00;-0175,00;+0376,00;-0,000;-0,000;-0,000;-0,000\"","\"+0057,00;-0001,00;+0041,00;-0,000;-0,000;-0,000;-0,000\"","\"-0639,00;-0405,00;-0060,00;-0,000;-0,000;-0,000;-0,000\"","\"+0088,00;+0109,00;+0122,00;-0,000;-0,000;-0,000;-0,000\"","\"-0170,00;-0042,00;-0084,00;-0,000;-0,000;-0,000;-0,000\"","\"+0165,00;+0011,00;-0206,00;-0,000;-0,000;-0,000;-0,000\"","\"+0089,50;+0093,80;+0123,10;-0,000;-0,000;+0,156;-1,200\"","\"+0083,11;+0097,38;+0117,23;+0,006;+0,045;-0,044;-0,122\"","\"+0087,00;+0095,00;+0120,00;-0,000;-0,000;-0,000;-0,000\"","\"+0084,00;+0097,00;+0117,00;-0,000;-0,000;-0,000;+14,190\"","\"+0083,00;+0095,00;+0116,00;-0,000;-0,000;-0,000;+14,190\"","\"+0168,00;+0060,00;-0320,00;-0,000;-0,000;-0,000;+54,740\"","\"-0000,00;-0012,00;-0006,00;-0,000;-0,000;-0,000;-0,031\"","\"+0077,90;+0132,90;-0043,70;-0,000;-0,000;-0,000;-0,000\"","\"-0230,00;+0199,00;+0752,00;-0,000;-0,000;-0,000;-0,000\"","\"+0084,00;+0095,00;+0130,00;-0,000;-0,000;-0,000;-0,000\"","\"-0011,00;-0114,00;-0195,00;-0,000;-0,000;-0,000;-0,000\"","\"-0164,00;-0138,00;+0189,00;-0,000;-0,000;-0,000;-0,000\"","\"-0000,00;-0125,00;-0194,00;-0,000;-0,000;-0,000;-0,000\"","\"+0288,00;-0175,00;+0376,00;-0,000;-0,000;-0,000;-0,000\"","\"+0057,00;-0001,00;+0041,00;-0,000;-0,000;-0,000;-0,000\"","\"-0000,00;-0125,00;-0194,00;-0,000;-0,000;-0,000;-0,000\"","\"+0156,00;+0271,00;+0189,00;-0,000;-0,000;-0,000;-0,000\"","\"+0073,00;-0046,00;+0086,00;-0,000;-0,000;-0,000;-0,000\"","\"+0127,00;+0769,00;-0472,00;-0,000;-0,000;-0,000;-0,000\"","\"-0056,00;+0268,00;+0182,50;-0,000;-0,000;-0,554;-0,227\"","\"-0000,00;-0125,00;-0194,00;-0,000;-0,000;-0,000;-0,000\"","\"+0007,00;-0152,00;-0178,00;-0,000;-0,000;-0,000;-0,000\"","\"-0252,00;+0209,00;+0751,00;-0,000;-0,000;-0,000;-0,000\"","\"-0145,00;+0187,00;-0103,00;-0,000;-0,000;-0,000;-0,000\"","\"+0207,00;-0107,00;-0052,00;-0,000;-0,000;-0,000;-0,000\"","\"+0007,00;-0152,00;-0178,00;-0,000;-0,000;-0,000;-0,000\"","\"+0007,00;-0152,00;-0178,00;-0,000;-0,000;-0,000;-0,000\"","\"+0499,00;+0249,00;-0314,00;-0,000;-0,000;-0,000;-0,000\"","\"+0203,00;-0141,00;-0053,00;-0,000;-0,000;-0,000;-0,000\"","\"+0097,00;+0103,00;+0120,00;-0,000;-0,000;-0,000;-0,000\"","\"+0255,00;+0065,00;-0009,00;-0,000;-0,000;-0,000;-0,000\"","\"+0097,00;+0088,00;+0135,00;-0,000;-0,000;-0,000;-0,000\"","\"-0114,00;+0116,00;+0333,00;-0,000;-0,000;-0,000;-0,000\"","\"-0208,00;+0435,00;+0229,00;-0,000;-0,000;-0,000;-0,000\"","\"+0007,00;-0152,00;-0178,00;-0,000;-0,000;-0,000;-0,000\"","\"-0230,00;+0199,00;+0752,00;-0,000;-0,000;-0,000;-0,000\"","\"+0007,00;-0152,00;-0178,00;-0,000;-0,000;-0,000;-0,000\"","\"-0252,00;+0209,00;+0751,00;-0,000;-0,000;-0,000;-0,000\"","\"-0089,00;+0279,00;+0183,00;-0,000;-0,000;-0,000;-0,000\"","\"-0045,00;+0290,00;+0172,00;-0,000;-0,000;-0,000;-0,000\"","\"-0065,00;+0290,00;+0190,00;-0,000;-0,000;-0,000;-0,000\"","\"-0056,00;+0284,00;+0181,00;-0,000;-0,000;-0,000;-0,000\"","\"-0145,00;-0075,00;+0272,00;-0,000;-0,000;-0,000;-0,000\"","\"-0191,00;+0077,00;+0204,00;-0,000;-0,000;-0,000;-0,000\"","\"-0041,00;+0220,00;+0134,00;-0,000;-0,000;-0,000;-0,000\"","\"-0124,00;+0234,00;+0025,00;-0,000;-0,000;-0,000;-0,000\"","\"-0185,00;-0165,00;-0042,00;-0,000;-0,000;-0,000;-0,000\"","\"+0320,00;-0550,00;+0494,00;-0,000;-0,000;-0,000;-0,000\"","\"+0203,00;-0141,00;-0053,00;-0,000;-0,000;-0,000;-0,000\"","\"+0632,00;-0438,00;+0609,00;-0,000;-0,000;-0,000;-0,000\"","\"-0051,00;-0391,00;+0036,00;-0,000;-0,000;-0,000;-0,000\"","\"+0002,00;-0150,00;-0181,00;-0,000;-0,000;-0,000;-0,000\"","\"+0004,00;-0154,00;-0178,00;-0,000;-0,000;-0,000;-0,000\"","\"+0007,00;-0152,00;-0178,00;-0,000;-0,000;-0,000;-0,000\"","\"-0042,00;-0124,00;-0147,00;-0,000;-0,000;-0,000;-0,000\"","\"+0307,00;+0092,00;-0127,00;-0,000;-0,000;-0,000;-0,000\"","\"-0175,00;+0038,00;-0113,00;-0,000;-0,000;-0,000;-0,000\"","\"+0491,00;+0022,00;-0435,00;-0,000;-0,000;-0,000;-0,000\"","\"-0094,00;+0948,00;+1262,00;-0,000;-0,000;-0,000;-0,000\"","\"-0912,00;+0058,00;-1227,00;-0,000;-0,000;-0,000;-0,000\"","\"-0211,00;-0147,00;-0111,00;-0,000;-0,000;-0,000;-0,000\"","\"+0425,00;+0169,00;-0081,00;-0,000;-0,000;-0,000;-0,000\"","\"+0104,00;-0167,00;+0038,00;-0,000;-0,000;-0,000;-0,000\"","\"+0073,00;-0213,00;-0296,00;-0,000;-0,000;-0,000;-0,000\"","\"+0355,00;-0016,00;-0074,00;-0,000;-0,000;-0,000;-0,000\"","\"+0133,00;+0321,00;-0050,00;-0,000;-0,000;-0,000;-0,000\"","\"-0101,00;-0052,00;+0039,00;-0,000;-0,000;-0,000;-0,000\"","\"-0298,00;+0304,00;+0375,00;-0,000;-0,000;-0,000;-0,000\"","\"+0289,00;+0124,00;-0060,00;-0,000;-0,000;-0,000;-0,000\"","\"+0007,00;-0152,00;-0178,00;-0,000;-0,000;-0,000;-0,000\"","\"+0002,00;-0374,00;-0172,00;-0,000;-0,000;-0,000;-0,000\"","\"+0057,00;-0001,00;+0041,00;-0,000;-0,000;-0,000;-0,000\"","\"-0011,00;-0072,00;+0101,00;-0,000;-0,000;-0,000;-0,000\"","\"+0117,00;+0132,00;+0164,00;-0,000;-0,000;-0,000;-0,000\"","\"-0506,00;+0122,00;-0611,00;-0,000;-0,000;-0,000;-0,000\"","\"+0128,00;-0481,00;-0664,00;-0,000;-0,000;-0,000;-0,000\"","\"+0161,00;+0007,00;+0300,00;-0,000;-0,000;-0,000;-0,000\"","\"+0125,00;+0108,00;+0295,00;-0,000;-0,000;-0,000;-0,000\"","\"+0090,00;-0040,00;-0088,00;-0,000;-0,000;-0,000;-0,000\"","\"+0689,00;-0691,00;+0046,00;-0,000;-0,000;-0,000;-0,000\"","\"+0011,00;-0851,00;-0005,00;-0,000;-0,000;-0,000;-0,000\"","\"+0161,00;+0073,00;+0317,00;-0,000;-0,000;-0,000;-0,000\"","\"+0163,00;+0020,00;-0220,00;-0,000;-0,000;-0,000;-0,000\"","\"-0031,00;-0146,00;-0047,00;-0,000;-0,000;-0,000;-0,000\"","\"-0065,00;+0272,00;+0192,50;-0,000;-0,000;-0,554;-0,227\"","\"+0012,00;-0130,00;-0190,00;-0,000;-0,000;-0,000;-0,000\"","\"+0133,00;+0079,00;+0072,00;-0,000;-0,000;-0,000;-0,000\"","\"-0000,00;-0000,00;-0004,50;-0,000;-0,000;-0,814;+0,600\"","\"-0000,00;-0000,00;-0004,50;-0,000;-0,000;-0,814;+0,602\"","\"-0000,00;-0000,00;-0004,50;-0,000;-0,000;-0,814;+0,600\"","\"-0000,00;-0000,00;-0004,50;-0,000;-0,000;-0,554;-0,227\"","\"-0000,00;-0000,00;-0000,00;-0,000;-0,000;-0,000;-0,000\"","\"-0616,00;-0097,00;+0251,00;-0,000;-0,000;-0,000;-0,000\"",null,"\"-0289,00;-0734,00;-0257,00;-0,000;-0,000;-0,000;-0,000\"","\"-0000,00;-0125,00;-0194,00;-0,000;-0,000;-0,000;-0,000\"","\"+0092,00;+0093,00;-0122,00;-0,000;-0,000;-0,000;-0,000\"","\"+0087,00;+0095,00;+0120,00;-0,000;-0,000;-0,000;-0,000\"","\"-0084,00;+0022,00;-0209,00;-0,000;-0,000;-0,000;-0,000\"","\"+0346,00;+0001,00;-0224,00;-0,000;-0,000;-0,000;-0,000\"","\"+0134,00;-0229,00;+0029,00;-0,000;-0,000;-0,000;-0,000\"","\"+0057,00;-0001,00;+0041,00;-0,000;-0,000;-0,000;-0,000\"","\"+0288,00;-0175,00;+0376,00;-0,000;-0,000;-0,000;-0,000\"","\"+0057,00;-0001,00;+0041,00;-0,000;-0,000;-0,000;-0,000\"","\"+0133,00;+0077,00;+0051,00;-0,000;-0,000;-0,000;-0,000\"","\"+0088,00;+0109,00;+0122,00;-0,000;-0,000;-0,000;-0,000\"","\"-0011,00;-0072,00;+0101,00;-0,000;-0,000;-0,000;-0,000\"","\"+0249,17;+0152,09;-0391,46;-0,000;-0,000;-0,000;-0,000\"","\"+0250,20;+0153,09;-0391,70;-0,000;-0,000;-0,000;-0,000\"","\"+0128,16;+0282,42;-0021,93;-0,000;-0,000;-0,000;-0,000\"",null,"\"+0086,00;+0096,00;+0120,00;-0,000;-0,000;-0,000;-0,000\"","\"-0364,71;+0109,42;-0429,00;-0,000;-0,000;+0,156;-1,198\"",null,null,"\"+0689,00;-0691,00;+0046,00;-0,000;-0,000;-0,000;-0,000\"","\"-0001,00;-0140,00;-0165,00;-0,000;-0,000;-0,000;-0,000\"","\"+0689,00;-0691,00;+0046,00;-0,000;-0,000;-0,000;-0,000\"","\"+0128,00;+0018,00;-0224,00;-0,000;-0,000;-0,000;-0,000\"","\"+0011,00;-0851,00;-0005,00;-0,000;-0,000;-0,000;-0,000\"","\"-0008,21;-0861,39;-0001,31;-0,000;-0,000;-0,814;+0,380\"","\"-0007,00;+0010,00;+0026,00;-0,000;-0,000;-0,000;-0,000\"","\"+0043,00;+0163,00;-0045,00;-0,000;-0,000;-0,000;-0,000\"","\"+0161,00;+0014,00;-0205,00;-0,000;-0,000;-0,000;-0,000\"","\"+0097,00;-0787,00;-0086,00;-0,000;-0,000;-0,000;-0,000\"","\"+0377,00;-0681,00;+0050,00;-0,000;-0,000;-0,000;-0,000\"","\"+0265,00;-0120,00;+0358,00;-0,000;-0,000;-0,000;-0,000\"","\"+0134,00;+0105,00;+0295,00;-0,000;-0,000;-0,000;-0,000\"","\"+0158,00;+0012,00;+0299,00;-0,000;-0,000;-0,000;-0,000\"","\"+0134,00;+0048,00;-0149,00;-0,000;-0,000;-0,000;-0,000\"","\"-0214,00;-0836,00;-0303,00;-0,000;-0,000;-0,000;-0,000\"","\"+0004,69;-0008,50;-0002,89;-0,000;-0,000;-0,000;-0,000\"","\"+0263,00;-0006,00;-0431,00;-0,000;-0,000;-0,000;-0,000\"","\"+0007,00;-0152,00;-0178,00;-0,000;-0,000;-0,000;-0,000\"","\"+0022,00;-0157,00;-0180,50;-0,000;-0,000;-0,554;-0,227\"","\"+0288,00;-0175,00;+0376,00;-0,000;-0,000;-0,000;-0,000\"","\"+0057,00;-0001,00;+0041,00;-0,000;-0,000;-0,000;-0,000\"","\"-0289,00;-0734,00;-0257,00;-0,000;-0,000;-0,000;-0,000\"","\"+0169,00;+0019,00;+0278,00;-0,000;-0,000;-0,000;-0,000\"","\"+0147,00;+0074,00;+0283,00;-0,000;-0,000;-0,000;-0,000\"","\"+0142,00;+0096,00;+0293,00;-0,000;-0,000;-0,000;-0,000\""]
["Depuis","Afrique du Sud / S Africa Cape","Clarke 1880 Mod.","\"-0136,00;-0108,00;-0292,00;-0,000;-0,000;-0,000;-0,000\""]
["Depuis","Alaska / NAD27","Clarke 1866","\"-0012,62;+0156,56;+0180,52;-0,000;-0,000;+0,814;+0,427\""]
["Depuis","Alaska / NAD27","Clarke 1866","\"-0005,00;+0135,00;+0172,00;-0,000;-0,000;-0,000;-0,000\""]
["Depuis","Alaska / NAD83","GRS80","\"-0000,00;-0000,00;-0000,00;-0,000;-0,000;-0,000;-0,000\""]
["Depuis","Amerique Central / NAD83","GRS80","\"-0000,00;-0000,00;-0000,00;-0,000;-0,000;-0,000;-0,000\""]
["Depuis","Arabie Saoudite / Nahrwan","Clarke 1880 Mod.","\"-0231,00;-0196,00;+0482,00;-0,000;-0,000;-0,000;-0,000\""]
["Depuis","Argentine / Campo Inchauste","International","\"-0148,00;+0136,00;+0090,00;-0,000;-0,000;-0,000;-0,000\""]
["Depuis","Argentine / S. America 1969","S America 1969","\"-0057,00;+0001,00;-0041,00;-0,000;-0,000;-0,000;-0,000\""]
["Depuis","Australie / Australian Geodetic 1966","RE 1967","\"-0133,00;-0048,00;+0148,00;-0,000;-0,000;-0,000;-0,000\""]
["Depuis","Australie / Australian Nat","RE 1967","\"-0122,00;-0041,00;+0150,00;-0,000;-0,000;+0,554;+0,227\"",null,null,null,null,null,null,null,null,null,null,null,null,null,null,null,null,null,null,null,null,null,null,null,null,null,null,null,null,null,null,null,null,null,null,null,null,null,null,null,null,null,null,null,null,null,null,null,null,null,null,null,null,null,null,null,null,null,null,null,null,null,null,null,null,null,null,null,null,null,null,null,null,null,null,null,null,null,null,null,null,null,null,null,null,null,null,null,null,null,null,null,null,null,null,null,null,null,null,null,null,null,null,null,null,null,null,null,null,null,null,null,null,null,null,null,null,null,null,null,null,null,null,null,null,null,null,null,null,"\"-0122,00;-0041,00;+0146,00;-0,000;-0,000;-0,000;-0,000\""]
["Depuis","Australie / Autralian","RE 1984","\"-0134,00;-0048,00;+0149,00;-0,000;-0,000;-0,000;-0,000\""]
["Depuis","Bahreïn / Ain El Abl 1970","International","\"-0150,00;-0251,00;-0002,00;-0,000;-0,000;-0,000;-0,000\""]
["Depuis","Bangladesh / Indian","Everest 1830","\"+0289,00;+0734,00;+0257,00;-0,000;-0,000;-0,000;-0,000\""]
["Depuis","Belize / NAD27","Clarke 1866","\"-0000,00;+0125,00;+0194,00;-0,000;-0,000;-0,000;-0,000\""]
["Depuis","Bolivie / Prov. S America 1956","International","\"-0288,00;+0175,00;-0376,00;-0,000;-0,000;-0,000;-0,000\""]
["Depuis","Bolivie / S. America 1969","S. America 1969","\"-0057,00;+0001,00;-0041,00;-0,000;-0,000;-0,000;-0,000\""]
["Depuis","Botswana / Cape Arc 1950","Clarke 1880 Mod","\"-0138,00;-0105,00;-0289,00;-0,000;-0,000;-0,000;-0,000\""]
["Depuis","Bresil / S. America 1969","S. America 1969","\"-0057,00;+0001,00;-0041,00;-0,000;-0,000;-0,000;-0,000\""]
["Depuis","Brunei / Timbalai","Everest 1830","\"-0689,00;+0691,00;-0046,00;-0,000;-0,000;-0,000;-0,000\""]
["Depuis","Canada / NAD27","Clarke 1866","\"-0010,00;+0158,00;+0187,00;-0,000;-0,000;-0,000;-0,000\""]
[null,"Canada / NAD27 (Canada)","Clarke 1866","\"-0009,00;+0139,00;+0177,50;-0,000;-0,000;+0,554;+0,227\"",null,null,null,null,null,null,null,null,null,null,null,null,null,null,null,null,null,null,null,null,null,null,null,null,null,null,null,null,null,null,null,null,null,null,null,null,null,null,null,null,null,null,null,null,null,null,null,null,null,null,null,null,null,null,null,null,null,null,null,null,null,null,null,null,null,null,null,null,null,null,null,null,null,null,null,null,null,null,null,null,null,null,null,null,null,null,null,null,null,null,null,null,null,null,null,null,null,null,null,null,null,null,null,null,null,null,null,null,null,null,null,null,null,null,null,null,null,null,null,null,null,null,null,null,null,null,null,null,"\"-0009,00;+0139,00;+0173,00;-0,000;-0,000;-0,000;-0,000\""]
["Depuis","Canal Panama / NAD27","Clarke 1866","\"-0000,00;+0125,00;+0201,00;-0,000;-0,000;-0,000;-0,000\""]
["Depuis","Chili / Prov. S Chilean 63","International","\"+0016,00;+0196,00;+0093,00;-0,000;-0,000;-0,000;-0,000\""]
["Depuis","Chili / S. America 1969","S. America 1969","\"-0057,00;+0001,00;-0041,00;-0,000;-0,000;-0,000;-0,000\""]
[null,"Chypre / ED50","International","\"-0104,00;-0101,00;-0140,00;-0,000;-0,000;-0,000;-0,000\""]
["Depuis","Colombie / Bogota Observatory","International","\"+0307,00;+0304,00;-0318,00;-0,000;-0,000;-0,000;-0,000\""]
["Depuis","Colombie / Prov. S America 1956","International","\"-0288,00;+0175,00;-0376,00;-0,000;-0,000;-0,000;-0,000\""]
["Depuis","Colombie / S. America 1969","S. America 1969","\"-0057,00;+0001,00;-0041,00;-0,000;-0,000;-0,000;-0,000\""]
["Depuis","Corée / Tokyo","Bessel 1841","\"-0128,00;+0481,00;+0664,00;-0,000;-0,000;-0,000;-0,000\""]
[null,"Egypte / ED50","International","\"-0130,00;-0117,00;-0151,00;-0,000;-0,000;-0,000;-0,000\""]
["Depuis","Egypte / Old Egyptian","Helmert 1906","\"-0130,00;+0110,00;-0013,00;-0,000;-0,000;-0,000;-0,000\""]
["Depuis","Emirats Arabes Unifies / Nahrwan","Clarke 1880 Mod","\"-0249,00;-0156,00;+0381,00;-0,000;-0,000;-0,000;-0,000\""]
["Depuis","Equateur / Prov. S American 1956","International","\"-0288,00;+0175,00;-0376,00;-0,000;-0,000;-0,000;-0,000\""]
["Depuis","Equateur / S American 1969","S American 1969","\"-0057,00;+0001,00;-0041,00;-0,000;-0,000;-0,000;-0,000\""]
["Depuis","Erytree / Massawa","Bessel 1841","\"+0639,00;+0405,00;+0060,00;-0,000;-0,000;-0,000;-0,000\""]
[null,"Espagne / ED50","International","\"-0088,00;-0109,00;-0122,00;-0,000;-0,000;-0,000;-0,000\""]
["Depuis","Espiranto Santos / Santo (DOS)","International","\"+0170,00;+0042,00;+0084,00;-0,000;-0,000;-0,000;-0,000\""]
["Depuis","Ethiopie / Adindan","Clarke 1880 Mod","\"-0165,00;-0011,00;+0206,00;-0,000;-0,000;-0,000;-0,000\""]
["Depuis","Europe / ED50","International","\"-0089,50;-0093,80;-0123,10;-0,000;-0,000;-0,156;+1,200\"",null,null,null,null,null,null,null,null,null,null,null,null,null,null,null,null,null,null,null,null,null,null,null,null,null,null,null,null,null,null,null,null,null,null,null,null,null,null,null,"\"-0006,39;+0003,58;-0005,87;-0,006;+0,045;-0,200;+1,078\"",null,null,null,null,null,null,null,null,null,null,null,null,null,null,null,null,null,null,null,null,null,null,null,null,null,null,null,null,null,null,null,null,null,null,null,null,null,null,null,null,null,null,null,null,null,null,null,null,null,null,null,null,null,null,null,null,null,null,null,null,null,null,null,null,null,null,null,null,null,null,null,null,null,null,null,null,null,null,null,null,null,null,null,null,null,"\"-0089,50;-0093,80;-0127,60;-0,000;-0,000;-0,970;+1,800\"","\"-0083,00;-0110,00;-0118,00;-0,000;-0,000;-0,000;-0,000\"","\"-0089,50;-0093,80;-0127,60;-0,000;-0,000;-0,970;+1,800\"",null,null,null,null,null,null,null,null,null,null,null,null,null,null,null,null,null,null,null,null,null,null,null,"\"-0116,50;+0041,20;-0038,60;-0,000;-0,000;-0,710;+0,973\""]
["Depuis","Europe / ED87","International","\"-0083,11;-0097,38;-0117,23;-0,006;-0,045;+0,044;+0,122\"",null,null,null,null,null,null,null,null,null,null,null,null,null,null,null,null,null,null,null,null,null,null,null,null,null,null,null,null,null,null,null,null,null,null,null,null,null,null,"\"+0006,39;-0003,58;+0005,87;+0,006;-0,045;+0,200;-1,078\"",null,null,null,null,null,null,null,null,null,null,null,null,null,null,null,null,null,null,null,null,null,null,null,null,null,null,null,null,null,null,null,null,null,null,null,null,null,null,null,null,null,null,null,null,null,null,null,null,null,null,null,null,null,null,null,null,null,null,null,null,null,null,null,null,null,null,null,null,null,null,null,null,null,null,null,null,null,null,null,null,null,null,null,null,null,null,null,null,null,null,"\"-0082,98;-0099,72;-0110,71;-0,105;+0,031;+0,080;-0,314\""]
[null,"Finlande / ED50","International","\"-0087,00;-0095,00;-0120,00;-0,000;-0,000;-0,000;-0,000\""]
["Depuis","France / ED50 IGN","International","\"-0084,00;-0097,00;-0117,00;-0,000;-0,000;-0,000;-14,19\""]
["Depuis","France / ED79 France","International","\"-0083,00;-0095,00;-0116,00;-0,000;-0,000;-0,000;-14,19\""]
["Depuis","France / IGN/NTF","Clarke 1880 (IGN)","\"-0168,00;-0060,00;+0320,00;-0,000;-0,000;-0,000;-54,74\""]
["Depuis","France / WGS72 France","WGS72","\"+0000,00;+0012,00;+0006,00;-0,000;-0,000;-0,000;+0,031\""]
["Depuis","Gabon / M'Paraloko","Clarke 1880","\"-0077,90;-0132,90;+0043,70;-0,000;-0,000;-0,000;-0,000\""]
["Depuis","Gizo / Gizo DOS 1968","International","\"+0230,00;-0199,00;-0752,00;-0,000;-0,000;-0,000;-0,000\""]
[null,"Grece / ED50","International","\"-0084,00;-0095,00;-0130,00;-0,000;-0,000;-0,000;-0,000\""]
["Depuis","Groenland / NAD27","Clarke 1866","\"+0011,00;+0114,00;+0195,00;-0,000;-0,000;-0,000;-0,000\""]
["Depuis","Groenland / Qornoq","International","\"+0164,00;+0138,00;-0189,00;-0,000;-0,000;-0,000;-0,000\""]
["Depuis","Guatemala / NAD27","Clarke 1866","\"-0000,00;+0125,00;+0194,00;-0,000;-0,000;-0,000;-0,000\""]
["Depuis","Guyana / Prov. S American 1956","International","\"-0288,00;+0175,00;-0376,00;-0,000;-0,000;-0,000;-0,000\""]
["Depuis","Guyana / S American 1969","S American","\"-0057,00;+0001,00;-0041,00;-0,000;-0,000;-0,000;-0,000\""]
["Depuis","Honduras / NAD27","Clarke 1866","\"-0000,00;+0125,00;+0194,00;-0,000;-0,000;-0,000;-0,000\""]
["Depuis","Hong Kong / Hong Kong 1963","International","\"-0156,00;-0271,00;-0189,00;-0,000;-0,000;-0,000;-0,000\""]
["Depuis","Icelande / Hjorsey 1955","International","\"-0073,00;+0046,00;-0086,00;-0,000;-0,000;-0,000;-0,000\""]
["Depuis","Ile d'Efate et Erromango / Bellevue (IGN)","International","\"-0127,00;-0769,00;+0472,00;-0,000;-0,000;-0,000;-0,000\""]
["Depuis","Ile d'Oahu / ?","Clarke 1866","\"+0056,00;-0268,00;-0182,50;-0,000;-0,000;+0,554;+0,227\"",null,null,null,null,null,null,null,null,null,null,null,null,null,null,null,null,null,null,null,null,null,null,null,null,null,null,null,null,null,null,null,null,null,null,null,null,null,null,null,null,null,null,null,null,null,null,null,null,null,null,null,null,null,null,null,null,null,null,null,null,null,null,null,null,null,null,null,null,null,null,null,null,null,null,null,null,null,null,null,null,null,null,null,null,null,null,null,null,null,null,null,null,null,null,null,null,null,null,null,null,null,null,null,null,null,null,null,null,null,null,null,null,null,null,null,null,null,null,null,null,null,null,null,null,null,null,null,null,"\"+0056,00;-0268,00;-0187,00;-0,000;-0,000;-0,000;-0,000\""]
["Depuis","Ile de Costa Rica / NAD27","Clarke 1866","\"-0000,00;+0125,00;+0194,00;-0,000;-0,000;-0,000;-0,000\""]
["Depuis","Ile de Cuba / NAD27","Clarke 1866","\"-0007,00;+0152,00;+0178,00;-0,000;-0,000;-0,000;-0,000\""]
["Depuis","Ile de Guam / Guam 1963","Clarke 1966","\"+0252,00;-0209,00;-0751,00;-0,000;-0,000;-0,000;-0,000\""]
["Depuis","Ile de Kerguelen / Kerguelen","International","\"+0145,00;-0187,00;+0103,00;-0,000;-0,000;-0,000;-0,000\""]
["Depuis","Ile de l'Ascension / Ascension 1958","International","\"-0207,00;+0107,00;+0052,00;-0,000;-0,000;-0,000;-0,000\""]
["Depuis","Ile de la Barbades / NAD27","Clarke 1866","\"-0007,00;+0152,00;+0178,00;-0,000;-0,000;-0,000;-0,000\""]
["Depuis","Ile de la Jamaique / NAD27","Clarke 1866","\"-0007,00;+0152,00;+0178,00;-0,000;-0,000;-0,000;-0,000\""]
["Depuis","Ile de Madere / SE Base","International","\"-0499,00;-0249,00;+0314,00;-0,000;-0,000;-0,000;-0,000\""]
["Depuis","Ile de Sao Miguel / Sao Braz","International","\"-0203,00;+0141,00;+0053,00;-0,000;-0,000;-0,000;-0,000\""]
[null,"Ile de Sardaigne / ED50","International","\"-0097,00;-0103,00;-0120,00;-0,000;-0,000;-0,000;-0,000\""]
["Depuis","Ile de Sardaigne / Rome 1940","International","\"-0255,00;-0065,00;+0009,00;-0,000;-0,000;-0,000;-0,000\""]
[null,"Ile de Sicile / ED50","International","\"-0097,00;-0088,00;-0135,00;-0,000;-0,000;-0,000;-0,000\""]
["Depuis","Ile de Tern / Asrto B4","International","\"+0114,00;-0116,00;-0333,00;-0,000;-0,000;-0,000;-0,000\""]
["Depuis","Ile Diego Garcia / ISTS 073 Astro 1969","International","\"+0208,00;-0435,00;-0229,00;-0,000;-0,000;-0,000;-0,000\""]
["Depuis","Ile Dominique / NAD27","Clarke 1866","\"-0007,00;+0152,00;+0178,00;-0,000;-0,000;-0,000;-0,000\""]
["Depuis","Ile Georgia / DOS 1968","International","\"+0230,00;-0199,00;-0752,00;-0,000;-0,000;-0,000;-0,000\""]
["Depuis","Ile Grand Cayman / NAD27","Clarke 1866","\"-0007,00;+0152,00;+0178,00;-0,000;-0,000;-0,000;-0,000\""]
["Depuis","Ile Guadalcanal / Gux 1 Astro","International","\"+0252,00;-0209,00;-0751,00;-0,000;-0,000;-0,000;-0,000\""]
["Depuis","Ile Hawaii Hawaii / Old Hawaiian","Clarke 1866","\"+0089,00;-0279,00;-0183,00;-0,000;-0,000;-0,000;-0,000\""]
["Depuis","Ile Hawaii Kauai / Old Hawaiian","Clarke 1866","\"+0045,00;-0290,00;-0172,00;-0,000;-0,000;-0,000;-0,000\"",null,null,null,null,null,null,null,null,null,null,null,null,null,null,null,null,null,null,null,null,null,null,null,null,null,null,null,null,null,null,null,null,null,null,null,null,null,null,null,null,null,null,null,null,null,null,null,null,null,null,null,null,null,null,null,null,null,null,null,null,null,null,null,null,null,null,null,null,null,null,null,null,null,null,null,null,null,null,null,null,null,null,null,null,null,null,null,null,null,null,null,null,null,null,null,null,null,null,null,null,null,null,null,null,null,null,null,null,null,null,null,null,null,null,null,null,null,null,null,null,null,null,null,null,null,null,null,null,"\"+0271,00;-0046,00;-0181,0;-0,000;-0,000;-0,000;-0,000\""]
["Depuis","Ile Hawaii Maui / Old Hawaiian","Clarke 1866","\"+0065,00;-0290,00;-0190,00;-0,000;-0,000;-0,000;-0,000\"",null,null,null,null,null,null,null,null,null,null,null,null,null,null,null,null,null,null,null,null,null,null,null,null,null,null,null,null,null,null,null,null,null,null,null,null,null,null,null,null,null,null,null,null,null,null,null,null,null,null,null,null,null,null,null,null,null,null,null,null,null,null,null,null,null,null,null,null,null,null,null,null,null,null,null,null,null,null,null,null,null,null,null,null,null,null,null,null,null,null,null,null,null,null,null,null,null,null,null,null,null,null,null,null,null,null,null,null,null,null,null,null,null,null,null,null,null,null,null,null,null,null,null,null,null,null,null,null,"\"+0272,00;-0065,00;+0197,00;-0,000;-0,000;-0,000;-0,000\""]
["Depuis","Ile Hawaii Oahu / Old Hawaiian","Clarke 1866","\"+0056,00;-0284,00;-0181,00;-0,000;-0,000;-0,000;-0,000\"",null,null,null,null,null,null,null,null,null,null,null,null,null,null,null,null,null,null,null,null,null,null,null,null,null,null,null,null,null,null,null,null,null,null,null,null,null,null,null,null,null,null,null,null,null,null,null,null,null,null,null,null,null,null,null,null,null,null,null,null,null,null,null,null,null,null,null,null,null,null,null,null,null,null,null,null,null,null,null,null,null,null,null,null,null,null,null,null,null,null,null,null,null,null,null,null,null,null,null,null,null,null,null,null,null,null,null,null,null,null,null,null,null,null,null,null,null,null,null,null,null,null,null,null,null,null,null,null,"\"+0268,00;-0056,00;+0187,00;-0,000;-0,000;-0,000;-0,000\""]
["Depuis","Ile Iwo Jima / Astro Beacon East","International","\"+0145,00;+0075,00;-0272,00;-0,000;-0,000;-0,000;-0,000\""]
["Depuis","Ile Johnson / Johnson Is 1961","International","\"+0191,00;-0077,00;-0204,00;-0,000;-0,000;-0,000;-0,000\""]
["Depuis","Ile Mahe / Ile Mahe 1971","Clarke 1880 Mod","\"+0041,00;-0220,00;-0134,00;-0,000;-0,000;-0,000;-0,000\""]
["Depuis","Ile Marcus / Asrto Stn 1952","International","\"+0124,00;-0234,00;-0025,00;-0,000;-0,000;-0,000;-0,000\""]
["Depuis","Ile Pitcairn / Pitcairn Astro 1967","International","\"+0185,00;+0165,00;+0042,00;-0,000;-0,000;-0,000;-0,000\""]
[null,"Ile Saint Helene / Astro DOS 7","International","\"-0320,00;+0550,00;-0494,00;-0,000;-0,000;-0,000;-0,000\""]
["Depuis","Ile Santa Maria / Sao Braz","International","\"-0203,00;+0141,00;+0053,00;-0,000;-0,000;-0,000;-0,000\""]
["Depuis","Ile Tristan da Cunha / Tristan Astro","International","\"-0632,00;+0438,00;-0609,00;-0,000;-0,000;-0,000;-0,000\""]
["Depuis","Ile Viti Levu / Viti Levu 1916","Clarke 1880 Mod","\"+0051,00;+0391,00;-0036,00;-0,000;-0,000;-0,000;-0,000\""]
["Depuis","Iles Bahamas / Cape Canaveral","Clarke 1866","\"-0002,00;+0150,00;+0181,00;-0,000;-0,000;-0,000;-0,000\""]
["Depuis","Iles Bahamas / NAD27","Clarke 1866","\"-0004,00;+0154,00;+0178,00;-0,000;-0,000;-0,000;-0,000\""]
["Depuis","Iles Caicos / NAD27","Clarke 1866","\"-0007,00;+0152,00;+0178,00;-0,000;-0,000;-0,000;-0,000\""]
["Depuis","Iles Caiman / LC 5 Astro","Clarke 1866","\"+0042,00;+0124,00;+0147,00;-0,000;-0,000;-0,000;-0,000\""]
["Depuis","Iles Canaries / Pico de las Nieves","International","\"-0307,00;-0092,00;+0127,00;-0,000;-0,000;-0,000;-0,000\""]
["Depuis","Iles Chatam / Ile Chatam 1971","International","\"+0175,00;-0038,00;+0113,00;-0,000;-0,000;-0,000;-0,000\""]
["Depuis","Iles Cocos / Australian","RE 1967","\"-0491,00;-0022,00;+0435,00;-0,000;-0,000;-0,000;-0,000\""]
["Depuis","Iles de Mascarenes / Reunion","International","\"+0094,00;-0948,00;-1262,00;-0,000;-0,000;-0,000;-0,000\""]
["Depuis","Iles de Midway / Midway Astro 1961","International","\"+0912,00;-0058,00;+1227,00;-0,000;-0,000;-0,000;-0,000\""]
["Depuis","Iles de Paques / Iles de Paques 1967","International","\"+0211,00;+0147,00;+0111,00;-0,000;-0,000;-0,000;-0,000\""]
["Depuis","Iles des Açores / Observatorio 1966","International","\"-0425,00;-0169,00;+0081,00;-0,000;-0,000;-0,000;-0,000\""]
["Depuis","Iles des Açores / SW Base","International","\"-0104,00;+0167,00;-0038,00;-0,000;-0,000;-0,000;-0,000\""]
["Depuis","Iles des Bermudes / Bermuda 1957","Clarke 1866","\"-0073,00;+0213,00;+0296,00;-0,000;-0,000;-0,000;-0,000\""]
["Depuis","Iles Falklands / Sapper Hill 1943","International","\"-0355,00;+0016,00;+0074,00;-0,000;-0,000;-0,000;-0,000\""]
["Depuis","Iles Maldives / Gandajika Base","International","\"-0133,00;-0321,00;+0050,00;-0,000;-0,000;-0,000;-0,000\""]
["Depuis","Iles Marshall / Wake Eniwetok 1960","Hough","\"+0101,00;+0052,00;-0039,00;-0,000;-0,000;-0,000;-0,000\""]
["Depuis","Iles Phoenix / Canton Astro 1966","International","\"+0298,00;-0304,00;-0375,00;-0,000;-0,000;-0,000;-0,000\""]
["Depuis","Iles Salvages / Marco Astro","International","\"-0289,00;-0124,00;+0060,00;-0,000;-0,000;-0,000;-0,000\""]
["Depuis","Iles Sous le Vent / NAD27","Clarke 1866","\"-0007,00;+0152,00;+0178,00;-0,000;-0,000;-0,000;-0,000\""]
["Depuis","Iles Trinité & Tobago / Naparima (BWI)","International","\"-0002,00;+0374,00;+0172,00;-0,000;-0,000;-0,000;-0,000\""]
["Depuis","Iles Trinité & Tobago / S. American 1969","S. American 1969","\"-0057,00;+0001,00;-0041,00;-0,000;-0,000;-0,000;-0,000\""]
["Depuis","Iles Vierges / Puerto Rico","Clarke 1866","\"+0011,00;+0072,00;-0101,00;-0,000;-0,000;-0,000;-0,000\""]
[null,"Iran / ED50","International","\"-0117,00;-0132,00;-0164,00;-0,000;-0,000;-0,000;-0,000\""]
["Depuis","Irelande / Ireland 1965","Airy Mod","\"+0506,00;-0122,00;+0611,00;-0,000;-0,000;-0,000;-0,000\""]
["Depuis","Japon / Tokyo","Bessel 1841","\"-0128,00;+0481,00;+0664,00;-0,000;-0,000;-0,000;-0,000\""]
["Depuis","Kenya / Cape Arc 1960","Clarke 1880 Mod","\"-0161,00;-0007,00;-0300,00;-0,000;-0,000;-0,000;-0,000\""]
["Depuis","Lesotho / Cape Arc 1950","Clarke 1880 Mod","\"-0125,00;-0108,00;-0295,00;-0,000;-0,000;-0,000;-0,000\""]
["Depuis","Liberia / Liberia 1964","Clarke 1880 Mod","\"-0090,00;+0040,00;+0088,00;-0,000;-0,000;-0,000;-0,000\""]
["Depuis","Malaisie (Est) / Timbalia","Everest 1830","\"-0689,00;+0691,00;-0046,00;-0,000;-0,000;-0,000;-0,000\""]
["Depuis","Malaisie (Ouest) / Kertau 1948","Everest Mod","\"-0011,00;+0851,00;+0005,00;-0,000;-0,000;-0,000;-0,000\""]
["Depuis","Malawi / Cape Arc 1950","Clarke 1880 Mod","\"-0161,00;-0073,00;-0317,00;-0,000;-0,000;-0,000;-0,000\""]
["Depuis","Mali / Adindan","Clarke 1880 Mod","\"-0163,00;-0020,00;+0220,00;-0,000;-0,000;-0,000;-0,000\""]
["Depuis","Maroc / Merchich","Clarke 1880 Mod","\"+0031,00;+0146,00;+0047,00;-0,000;-0,000;-0,000;-0,000\""]
["Depuis","Maui / Maui","Clarke 1866","\"+0065,00;-0272,00;-0192,50;-0,000;-0,000;+0,554;+0,227\"",null,null,null,null,null,null,null,null,null,null,null,null,null,null,null,null,null,null,null,null,null,null,null,null,null,null,null,null,null,null,null,null,null,null,null,null,null,null,null,null,null,null,null,null,null,null,null,null,null,null,null,null,null,null,null,null,null,null,null,null,null,null,null,null,null,null,null,null,null,null,null,null,null,null,null,null,null,null,null,null,null,null,null,null,null,null,null,null,null,null,null,null,null,null,null,null,null,null,null,null,null,null,null,null,null,null,null,null,null,null,null,null,null,null,null,null,null,null,null,null,null,null,null,null,null,null,null,null,"\"+0065,00;-0272,00;-0197,00;-0,000;-0,000;-0,000;-0,000\""]
["Depuis","Mexique / NAD27","Clarke 1866","\"-0012,00;+0130,00;+0190,00;-0,000;-0,000;-0,000;-0,000\""]
["Depuis","Mindanao / Luzon","Clarke 1866","\"-0133,00;-0079,00;-0072,00;-0,000;-0,000;-0,000;-0,000\""]
["Depuis","Monde / DOPPLER","Precise","\"-0000,00;-0000,00;+0004,50;-0,000;-0,000;+0,814;-0,600\"",null,null,null,null,null,null,null,null,null,null,null,null,null,null,null,null,null,null,null,null,null,null,null,null,null,null,null,null,null,null,null,null,null,null,null,null,null,null,null,null,null,null,null,null,null,null,null,null,null,null,null,null,null,null,null,null,null,null,null,null,null,null,null,null,null,null,null,null,null,null,null,null,null,null,null,null,null,null,null,null,null,null,null,null,null,null,null,null,null,null,null,null,null,null,null,null,null,null,null,null,null,null,null,null,null,null,null,null,null,null,null,null,null,null,null,null,null,null,null,null,null,null,null,null,null,null,null,"\"-0000,00;-0000,00;-0000,00;-0,000;-0,000;-0,260;+0,827\"","\"-0000,00;-0000,00;-0000,00;-0,000;-0,000;+0,260;-0,827\"","\"-0000,00;-0000,00;+0004,50;-0,000;-0,000;+0,814;-6,000\""]
["Depuis","Monde / NWL10D","Broadcast","\"-0000,00;-0000,00;+0004,50;-0,000;-0,000;+0,814;-0,602\""]
["Depuis","Monde / NWL9D","Precise","\"-0000,00;-0000,00;+0004,50;-0,000;-0,000;+0,814;-0,600\""]
["Depuis","Monde / WGS72","WGS72","\"-0000,00;-0000,00;+0004,50;-0,000;-0,000;+0,554;+0,227\""]
[null,"Monde / WGS84 SEA","WGS84","\"-0000,00;-0000,00;+0000,00;-0,000;-0,000;+0,000;-0,000\""]
["Depuis","Namibie / Schwarzeck","Bessel 1841 Mod","\"+0616,00;+0097,00;-0251,00;-0,000;-0,000;-0,000;-0,000\""]
["Depuis","Neherlandes / RD","Bessel RD",null,null,null,null,null,null,null,null,null,null,null,null,null,null,null,null,null,null,null,null,null,null,null,null,null,null,null,null,null,null,null,null,null,null,null,null,null,null,null,"\"+0676,52;+0121,57;+0595,27;-0,000;-0,000;-0,000;-0,000\""]
["Depuis","Nepal / Indian","Everst 1830","\"+0289,00;+0734,00;+0257,00;-0,000;-0,000;-0,000;-0,000\""]
["Depuis","Nicaragua / NAD27","Clarke 1866","\"-0000,00;+0125,00;+0194,00;-0,000;-0,000;-0,000;-0,000\""]
["Depuis","Nigeria / Minna","Clarke 1880 Mod","\"-0092,00;-0093,00;+0122,00;-0,000;-0,000;-0,000;-0,000\""]
[null,"Norvège / ED50","International","\"-0087,00;-0095,00;-0120,00;-0,000;-0,000;-0,000;-0,000\""]
["Depuis","Nouvelles Zelandes / GD 1949","International","\"+0084,00;-0022,00;+0209,00;-0,000;-0,000;-0,000;-0,000\""]
["Depuis","Oman / Oman","Clarke 1880 Mod","\"-0346,00;-0001,00;+0224,00;-0,000;-0,000;-0,000;-0,000\""]
["Depuis","Paraguay / Chua Astro","International","\"-0134,00;+0229,00;-0029,00;-0,000;-0,000;-0,000;-0,000\""]
["Depuis","Paraguay / S American 1969","S American 1969","\"-0057,00;+0001,00;-0041,00;-0,000;-0,000;-0,000;-0,000\""]
["Depuis","Perou / Prov S American 1956","International","\"-0288,00;+0175,00;-0376,00;-0,000;-0,000;-0,000;-0,000\""]
["Depuis","Perou / S American 1969","S American 1969","\"-0057,00;+0001,00;-0041,00;-0,000;-0,000;-0,000;-0,000\""]
["Depuis","Phillipines / Luzon 1911","Clarke 1866","\"-0133,00;-0077,00;-0051,00;-0,000;-0,000;-0,000;-0,000\""]
[null,"Portugal / ED50","International","\"-0088,00;-0109,00;-0122,00;-0,000;-0,000;-0,000;-0,000\""]
["Depuis","Puerto Rico / Puerto Rico","Clarke 1866","\"+0011,00;+0072,00;-0101,00;-0,000;-0,000;-0,000;-0,000\""]
["Depuis","Qatar / Nahrwan","Clarke 1880 Mod","\"-0249,17;-0152,09;+0391,46;-0,000;-0,000;-0,000;+0,000\""]
[null,"Qatar / Nahrwan Maersk","Clarke 1880 Mod","\"-0250,20;-0153,09;+0391,70;-0,000;-0,000;-0,000;+0,000\""]
["Depuis","Qatar / Qatar National","International","\"-0128,16;-0282,42;+0021,93;-0,000;-0,000;-0,000;-0,000\""]
["Depuis","Royaume Uni / DOPPLER","Precise",null,null,null,null,null,null,null,null,null,null,null,null,null,null,null,null,null,null,null,null,null,null,null,null,null,null,null,null,null,null,null,null,null,null,null,null,null,null,null,null,null,null,null,null,null,null,null,null,null,null,null,null,null,null,null,null,null,null,null,null,null,null,null,null,null,null,null,null,null,null,null,null,null,null,null,null,null,null,null,null,null,null,null,null,null,null,null,null,null,null,null,null,null,null,null,null,null,null,null,null,null,null,null,null,null,null,null,null,null,null,null,null,null,null,null,null,null,null,null,null,null,null,null,null,null,null,null,null,null,null,null,null,null,null,null,null,null,null,null,null,null,null,null,null,null,null,null,null,null,null,null,"\"-0370,30;+0111,06;-0431,17;-0,000;-0,000;+0,800;-0,400\""]
["Depuis","Royaume Uni / ED50","International","\"-0086,00;-0096,00;-0120,00;-0,000;-0,000;-0,000;-0,000\"",null,null,null,null,null,null,null,null,null,null,null,null,null,null,null,null,null,null,null,null,null,null,null,null,null,null,null,null,null,null,null,null,null,null,null,null,null,null,null,null,null,null,null,null,null,null,null,null,null,null,null,null,null,null,null,null,null,null,null,null,null,null,null,null,null,null,null,null,null,null,null,null,null,null,null,null,null,null,null,null,null,null,null,null,null,null,null,null,null,null,null,null,null,null,null,null,null,null,null,null,null,null,null,null,null,null,null,null,null,null,null,null,null,null,null,null,null,null,null,null,null,null,null,null,null,null,null,null,null,null,null,null,null,null,null,null,null,null,null,null,null,null,null,null,null,null,null,null,null,null,"\"-0459,80;+0017,26;-0558,77;-0,000;-0,000;-0,170;+1,400\""]
["Depuis","Royaume Uni / OS(SN)80","Airy","\"+0364,71;-0109,42;+0429,00;-0,000;-0,000;-0,156;+1,198\"",null,null,null,null,null,null,null,null,null,null,null,null,null,null,null,null,null,null,null,null,null,null,null,null,null,null,null,null,null,null,null,null,null,null,null,null,null,null,null,null,null,null,null,null,null,null,null,null,null,null,null,null,null,null,null,null,null,null,null,null,null,null,null,null,null,null,null,null,null,null,null,null,null,null,null,null,null,null,null,null,null,null,null,null,null,null,null,null,null,null,null,null,null,null,null,null,null,null,null,null,null,null,null,null,null,null,null,null,null,null,null,null,null,null,null,null,null,null,null,null,null,null,null,null,null,null,null,null,null,null,null,null,null,null,null,null,null,null,null,null,null,null,null,null,null,null,null,null,null,"\"+0454,21;-0015,62;+0552,10;-0,000;-0,000;-0,000;-0,000\""]
["Depuis","Russie / Pulkovo","Krassovsky",null,null,null,null,null,null,null,null,null,null,null,null,null,null,null,null,null,null,null,null,null,null,null,null,null,null,null,null,null,null,null,null,null,null,null,null,null,null,null,"\"+0116,00;-0041,20;+0038,60;-0,000;-0,000;+0,710;-0,973\""]
["Depuis","Russie / WGS72","WGS72",null,null,null,null,null,null,null,null,null,null,null,null,null,null,null,null,null,null,null,null,null,null,null,null,null,null,null,null,null,null,null,null,null,null,null,null,null,null,null,null,null,null,null,null,null,null,null,null,null,null,null,null,null,null,null,null,null,null,null,null,null,null,null,null,null,null,null,null,null,null,null,null,null,null,null,null,null,null,null,null,null,null,null,null,null,null,null,null,null,null,null,null,null,null,null,null,null,null,null,null,null,null,null,null,null,null,null,null,null,null,null,null,null,null,null,null,null,null,null,null,null,null,null,null,null,null,null,null,null,null,null,null,null,null,null,null,null,null,null,null,null,null,null,null,null,null,null,null,null,null,null,null,"\"-0027,00;+0135,00;+0089,00;-0,000;-0,000;-0,000;-0,000\""]
["Depuis","Sabah / Timbalai 1948","Everest 1830","\"-0689,00;+0691,00;-0046,00;-0,000;-0,000;-0,000;-0,000\""]
["Depuis","San Salvador / NAD27","Clarke 1866","\"+0001,00;+0140,00;+0165,00;-0,000;-0,000;-0,000;-0,000\""]
["Depuis","Sarawak / Timbalai 1948","Everst 1830","\"-0689,00;+0691,00;-0046,00;-0,000;-0,000;-0,000;-0,000\""]
["Depuis","Senegal / Adindan","Clarke 1880 Mod","\"-0128,00;-0018,00;+0224,00;-0,000;-0,000;-0,000;-0,000\""]
["Depuis","Singapour / Kertau 1948","Everest Mod","\"-0011,00;+0851,00;+0005,00;-0,000;-0,000;-0,000;-0,000\""]
["Depuis","Singapour / Kertau 1948","Everest 1830","\"+0008,21;+0861,39;+0001,31;-0,000;-0,000;+0,814;-0,380\""]
["Depuis","Singapour / South Asia","Fisher Mod","\"+0007,00;-0010,00;-0026,00;-0,000;-0,000;-0,000;-0,000\""]
["Depuis","Somalie / Afgooye","Krassovsky","\"-0043,00;-0163,00;+0045,00;-0,000;-0,000;-0,000;-0,000\""]
["Depuis","Soudan / Adindan","Clarke 1880 Mod","\"-0161,00;-0014,00;+0205,00;-0,000;-0,000;-0,000;-0,000\""]
["Depuis","Sri Lanka / Kandawala","Everest 1830","\"-0097,00;+0787,00;+0086,00;-0,000;-0,000;-0,000;-0,000\""]
["Depuis","Sumatra / Djakarta (Batavia)","Bessel 1841","\"-0377,00;+0681,00;-0050,00;-0,000;-0,000;-0,000;-0,000\""]
["Depuis","Surinam / Zanderij","International","\"-0265,00;+0120,00;-0358,00;-0,000;-0,000;-0,000;-0,000\""]
[null,"Swaziland / Cape Arc 1950","Clarke 1880","\"-0134,00;-0105,00;-0295,00;-0,000;-0,000;-0,000;-0,000\""]
["Depuis","Tanzanie / Cape Arc 1960","Clarke 1880","\"-0158,00;-0012,00;-0299,00;-0,000;-0,000;-0,000;-0,000\""]
["Depuis","Tasmanie / Australian National","RE 1967","\"-0134,00;-0048,00;+0149,00;-0,000;-0,000;-0,000;-0,000\""]
["Depuis","Thailande / Indian","Everest 1830","\"+0214,00;+0836,00;+0303,00;-0,000;-0,000;-0,000;-0,000\""]
["Depuis","Thailande / Moattama","WGS84","\"-0004,69;+0008,50;+0002,89;-0,000;-0,000;-0,000;-0,000\""]
["Depuis","Tunisie / Carthage","Clarke 1880 Mod","\"-0263,00;+0006,00;+0431,00;-0,000;-0,000;-0,000;-0,000\""]
["Depuis","Turquie / NAD27","Clarke 1866","\"-0007,00;+0152,00;+0178,00;-0,000;-0,000;-0,000;-0,000\""]
["Depuis","USA / NAD27 (CONUS)","Clarke 1866","\"-0022,00;+0157,00;+0180,50;-0,000;-0,000;+0,554;+0,227\"",null,null,null,null,null,null,null,null,null,null,null,null,null,null,null,null,null,null,null,null,null,null,null,null,null,null,null,null,null,null,null,null,null,null,null,null,null,null,null,null,null,null,null,null,null,null,null,null,null,null,null,null,null,null,null,null,null,null,null,null,null,null,null,null,null,null,null,null,null,null,null,null,null,null,null,null,null,null,null,null,null,null,null,null,null,null,null,null,null,null,null,null,null,null,null,null,null,null,null,null,null,null,null,null,null,null,null,null,null,null,null,null,null,null,null,null,null,null,null,null,null,null,null,null,null,null,null,null,"\"-0022,00;+0157,00;+0176,00;-0,000;-0,000;-0,000;-0,000\""]
["Depuis","Venezuela / Prov. S. American 1956","International","\"-0288,00;+0175,00;-0376,00;-0,000;-0,000;-0,000;-0,000\""]
["Depuis","Venezuela / S. American 1969","S. American 1969","\"-0057,00;+0001,00;-0041,00;-0,000;-0,000;-0,000;-0,000\""]
["Depuis","Vietnam / Indian","Everest 1830","\"+0289,00;+0734,00;+0257,00;-0,000;-0,000;-0,000;-0,000\""]
["Depuis","Zaire / Cape Arc 1950","Clarke 1880","\"-0169,00;-0019,00;-0278,00;-0,000;-0,000;-0,000;-0,000\""]
["Depuis","Zambie / Cape Arc 1950","Clarke 1880","\"-0147,00;-0074,00;-0283,00;-0,000;-0,000;-0,000;-0,000\""]
["Depuis","Zimbabwe / Cape Arc 1950","Clarke 1880","\"-0142,00;-0096,00;-0293,00;-0,000;-0,000;-0,000;-0,000\""]
["Depuis"," / "]
["Depuis"," / "]
["Depuis"," / "]
["Depuis"," / "]
["Depuis"," / "]
["Depuis"," / "]
["Depuis"," / "]
["Depuis"," / "]
["Depuis"," / "]