{"text_format":"1","workbook":"xlsx","n_sheets":7,"sheets":["Geodesie","Dialog1","Dialog2","Calcul shift geo","Modele de Route","Spheroides","Table Datum Shifts"],"not_rendered":{"charts":0,"images":0,"macros":1,"external_links":0,"defined_names":2,"comments":0,"pivot_tables":0},"unopened":[{"sheet":"Dialog1","index":1,"reason":"not_a_worksheet"},{"sheet":"Dialog2","index":2,"reason":"not_a_worksheet"},{"sheet":"Calcul shift geo","index":3,"reason":"part_missing"}],"bounds":{"document_bytes":16777216,"sheet_cells":100000,"rows_first":2000,"rows_last":500,"rows_between":2000,"halvings":0,"cell_chars":16384,"cell_head_chars":4096},"cells_cut":0,"cells_raw":0,"read":"whole","date_system":"1904"}

{"sheet":"Geodesie","index":0,"n_rows":26,"n_cols":11,"rows_kept":26,"cut":false,"hidden":false,"merged":[]}
["Paramètres de Base des Géodésies Utilisées"]
[]
["Index",null,null,"Système 1",null,null,"Index",null,null,"Système 2"]
["Datum:",1,null,"Région & Datum:",{"$f":"(INDEX('Table Datum Shifts'!B15:B203,B4))","v":"Monde / WGS84"},null,"Datum:",40,null,"Région & Datum:",{"$f":"(INDEX('Table Datum Shifts'!B15:B203,H4))","v":"Europe / ED50"}]
["Spheroide:",42,null,"Ellipsoïde:",{"$f":"INDEX(Spheroides!C8:C56,B5)","v":"WGS 84"},null,"Sphéroïde:",30,null,"Ellipsoïde",{"$f":"INDEX(Spheroides!C8:C56,H5)","v":"INTERNATIONAL"}]
[null,null,null,"Gd Axe:",{"$f":"INDEX(Spheroides!D8:D56,B5)","v":6378137},null,null,null,null,"Gd Axe",{"$f":"INDEX(Spheroides!D8:D56,H5)","v":6378388}]
[null,null,null,"Pt Axe:",{"$f":"INDEX(Spheroides!E8:E56,B5)","v":6356752.3140000002},null,null,null,null,"Pt Axe",{"$f":"INDEX(Spheroides!E8:E56,H5)","v":6356911.9460000005}]
[null,null,null,"e2",{"$f":"INDEX(Spheroides!F8:F56,B5)","v":6.6943800667646578E-3},null,null,null,null,"e2",{"$f":"INDEX(Spheroides!F8:F56,H5)","v":6.7226700623166684E-3}]
[null,null,null,"n",{"$f":"INDEX(Spheroides!G8:G56,B5)","v":1.6792204056685965E-3},null,null,null,null,"n",{"$f":"INDEX(Spheroides!G8:G56,H5)","v":1.6863406508729228E-3}]
[null,null,null,"1 / f",{"$f":"INDEX(Spheroides!H8:H56,B5)","v":298.25722014342756},null,null,null,null,"1 / f",{"$f":"INDEX(Spheroides!H8:H56,H5)","v":296.9999982305938}]
{"$rows_left_out":17}
{"sheet":"Modele de Route","index":4,"n_rows":71,"n_cols":30,"rows_kept":71,"cut":false,"hidden":false,"merged":[]}
["Version du 07/11/97","Position",{"$f":"Geodesie!E4","v":"Monde / WGS84"},null,null,null,null,null,null,"Geographical",null,null,{"$f":"Geodesie!K4","v":"Europe / ED50"},null,null,null,null,null,"Geographical",null,null,"Slack","Cable Distance",null,"Cable","Cumulative","Totals","Approx"]
["Christian Auroux","Number","Latitude",null,null,"Longitude",null,null,"Heading","Length","Cumul.",null,"Latitude",null,null,"Longitude",null,null,"Length","Cumul.",null,"%","Length","Cumul.","Type","by type","By Type","Depth",null,"Comments"]
["convgeogeo",null,null,null,null,null,null,null,null,"(km)","(km)",null,null,null,null,null,null,null,"(km)","(km)",null,null,"(km)","(km)",null,null,"(km)","(m)"]
[]
[null,1,36,47.551000000000002,{"$f":"IF(OR(C5<0,AND(C5=0,D5<0)),\"S\",\"N\")","v":"N"},22,52.758000000000003,{"$f":"IF(OR(F5<0,AND(F5=0,G5<0)),\"W\",\"E\")","v":"E"},null,null,0,null,{"$f":"TRUNC(geoshiftlat(C5,D5,F5,G5),0)","v":36},{"$f":"(geoshiftlat(C5,D5,F5,G5)-M5)*60","v":47.613141626559212},{"$f":"IF(OR(M5<0,AND(M5=0,N5<0)),\"S\",\"N\")","v":"N"},{"$f":"TRUNC(geoshiftlon(C5,D5,F5,G5),0)","v":22},{"$f":"(geoshiftlon(C5,D5,F5,G5)-P5)*60","v":52.795302948926093},{"$f":"IF(OR(P5<0,AND(P5=0,Q5<0)),\"W\",\"E\")","v":"E"},null,0,null,null,null,0,null,0,{"$f":"IF(Y4=Y6,\"\",Z5)","v":0},0,null,"Landing Point"]
[null,null,null,null,null,null,null,null,{"$f":"CAP(C5,D5,F5,G5,C7,D7,F7,G7)","v":52.663686330934596},{"$f":"Distance1(C5,D5,F5,G5,C7,D7,F7,G7)","v":175.2109585705135},null,null,null,null,null,null,null,null,{"$f":"Distance2(M5,N5,P5,Q5,M7,N7,P7,Q7)","v":175.20791373263708},null,null,2,{"$f":"S6*(1+V6/100)","v":178.71207200728983},null,"DA"]
[null,{"$f":"B5+1","v":2},37,45,{"$f":"IF(OR(C7<0,AND(C7=0,D7<0)),\"S\",\"N\")","v":"N"},23,87,{"$f":"IF(OR(F7<0,AND(F7=0,G7<0)),\"W\",\"E\")","v":"E"},null,null,{"$f":"K5+J6","v":175.2109585705135},null,{"$f":"TRUNC(geoshiftlat(C7,D7,F7,G7),0)","v":37},{"$f":"(geoshiftlat(C7,D7,F7,G7)-M7)*60","v":45.060594429022132},{"$f":"IF(OR(M7<0,AND(M7=0,N7<0)),\"S\",\"N\")","v":"N"},{"$f":"TRUNC(geoshiftlon(C7,D7,F7,G7),0)","v":24},{"$f":"(geoshiftlon(C7,D7,F7,G7)-P7)*60","v":27.035512684444285},{"$f":"IF(OR(P7<0,AND(P7=0,Q7<0)),\"W\",\"E\")","v":"E"},null,{"$f":"T5+S6","v":175.20791373263708},null,null,null,{"$f":"X5+W6","v":178.71207200728983},null,{"$f":"IF(Y6=Y4,Z5+W6,W6)","v":178.71207200728983},{"$f":"IF(Y6=Y8,\"\",Z7)","v":""},50,null,"*"]
[null,null,null,null,null,null,null,null,{"$f":"CAP(C7,D7,F7,G7,C9,D9,F9,G9)","v":275.24620753317743},{"$f":"Distance1(C7,D7,F7,G7,C9,D9,F9,G9)","v":50.57841048796449},null,null,null,null,null,null,null,null,50.576804824270816,null,null,2,51.588340920756231,null,"DA"]
[null,{"$f":"B7+1","v":3},37,47.5,{"$f":"IF(OR(C9<0,AND(C9=0,D9<0)),\"S\",\"N\")","v":"N"},23,52.7,{"$f":"IF(OR(F9<0,AND(F9=0,G9<0)),\"W\",\"E\")","v":"E"},null,null,{"$f":"K7+J8","v":225.78936905847797},null,{"$f":"TRUNC(geoshiftlat(C9,D9,F9,G9),0)","v":37},{"$f":"(geoshiftlat(C9,D9,F9,G9)-M9)*60","v":47.560706888483253},{"$f":"IF(OR(M9<0,AND(M9=0,N9<0)),\"S\",\"N\")","v":"N"},{"$f":"TRUNC(geoshiftlon(C9,D9,F9,G9),0)","v":23},{"$f":"(geoshiftlon(C9,D9,F9,G9)-P9)*60","v":52.736347106071833},{"$f":"IF(OR(P9<0,AND(P9=0,Q9<0)),\"W\",\"E\")","v":"E"},null,{"$f":"T7+S8","v":225.7847185569079},null,null,null,{"$f":"X7+W8","v":230.30041292804606},null,{"$f":"IF(Y8=Y6,Z7+W8,W8)","v":230.30041292804606},{"$f":"IF(Y8=Y10,\"\",Z9)","v":230.30041292804606},100,null,"DA/SA"]
[null,null,null,null,null,null,null,null,{"$f":"CAP(C9,D9,F9,G9,C11,D11,F11,G11)","v":184.23954447669777},{"$f":"Distance1(C9,D9,F9,G9,C11,D11,F11,G11)","v":13.911987037449761},null,null,null,null,null,null,null,null,13.912086388243926,null,null,2,14.190328116008805,null,"SA"]
{"$rows_left_out":62}
{"sheet":"Spheroides","index":5,"n_rows":56,"n_cols":8,"rows_kept":56,"cut":false,"hidden":false,"merged":[]}
["Liste des Ellipsoides Disponibles"]
[]
[]
[]
[]
[]
[null,null,"Nom","Demi Grand","Demi Petit","e2","n","1 / f"]
[null,1,"AIRY",6377563.3959999997,6356256.909,{"$f":"POWER(1/D8*(SQRT((D8*D8)-(E8*E8))),2)","v":6.6705400741490836E-3},1.6732202503250534E-3,{"$f":"1/((D8-E8)/D8)","v":299.32496126649505}]
[null,2,"AIRY MOD",6377340.1890000002,6356034.4479999999,6.6705399807736503E-3,1.6732203054869081E-3,299.32496546352854]
[null,3,"AUSTRALIAN NATIONAL 1967/84",6378160,6356774.7189999996,6.694541915624532E-3,null,298.24999727615801]
{"$rows_left_out":47}
{"sheet":"Table Datum Shifts","index":6,"n_rows":203,"n_cols":186,"rows_kept":203,"cut":false,"hidden":false,"merged":[]}
["Datum System 1",null,"\"-0231,00;-0196,00;+0482,00;-0,000;-0,000;-0,000;-0,000\""]
["Datum System 2",null,"\"-0084,00;-0095,00;-0130,00;-0,000;-0,000;-0,000;-0,000\""]
[null,null,{"$f":"MID(C1,2,8)","v":"-0231,00"},{"$f":"MID(C1,11,8)","v":"-0196,00"},{"$f":"MID(C1,20,8)","v":"+0482,00"},{"$f":"MID(C1,29,6)","v":"-0,000"},{"$f":"MID(C1,36,6)","v":"-0,000"},{"$f":"MID(C1,43,6)","v":"-0,000"},{"$f":"MID(C1,50,6)","v":"-0,000"}]
[null,null,{"$f":"MID(C2,2,8)","v":"-0084,00"},{"$f":"MID(C2,11,8)","v":"-0095,00"},{"$f":"MID(C2,20,8)","v":"-0130,00"},{"$f":"MID(C2,29,6)","v":"-0,000"},{"$f":"MID(C2,36,6)","v":"-0,000"},{"$f":"MID(C2,43,6)","v":"-0,000"},{"$f":"MID(C2,50,6)","v":"-0,000"}]
[null,null,{"$f":"C3-C4","v":-147},-101,612,0,0,0,0]
[null,null,{"$f":"ABS(C5)","v":147},101,612,0,0,0,0]
[null,null,{"$f":"TEXT(C6,\"0000,00\")","v":"0147,00"},{"$f":"TEXT(D6,\"0000,00\")","v":"0101,00"},{"$f":"TEXT(E6,\"0000,00\")","v":"0612,00"},{"$f":"TEXT(F6,\"0,000\")","v":"0,000"},{"$f":"TEXT(G6,\"0,000\")","v":"0,000"},{"$f":"TEXT(H6,\"0,000\")","v":"0,000"},{"$f":"TEXT(I6,\"0,000\")","v":"0,000"}]
[null,null,{"$f":"IF(C5>0,CONCATENATE(\"+\",C7),CONCATENATE(\"-\",C7))","v":"-0147,00"},"-0101,00","+0612,00","-0,000","-0,000","-0,000","-0,000"]
[null,null,{"$f":"CONCATENATE(\"\"\"\",C8,\";\")","v":"\"-0147,00;"},{"$f":"CONCATENATE(D8,\";\")","v":"-0101,00;"},{"$f":"CONCATENATE(E8,\";\")","v":"+0612,00;"},{"$f":"CONCATENATE(F8,\";\")","v":"-0,000;"},{"$f":"CONCATENATE(G8,\";\")","v":"-0,000;"},{"$f":"CONCATENATE(H8,\";\")","v":"-0,000;"},{"$f":"CONCATENATE(I8,\"\"\"\")","v":"-0,000\""}]
["Datum Calcule",null,{"$f":"CONCATENATE(C9,D9,E9,F9,G9,H9,I9)","v":"\"-0147,00;-0101,00;+0612,00;-0,000;-0,000;-0,000;-0,000\""}]
{"$rows_left_out":193}