{"text_format":"1","workbook":"xlsx","n_sheets":6,"sheets":["Geodesie","Modele","Projections","Couper_Inserer","Spheroides","Table Datum Shifts"],"not_rendered":{"charts":0,"images":0,"macros":1,"external_links":0,"defined_names":2,"comments":0,"pivot_tables":0},"unopened":[{"sheet":"Couper_Inserer","index":3,"reason":"part_missing"}],"bounds":{"document_bytes":16777216,"sheet_cells":100000,"rows_first":2000,"rows_last":500,"rows_between":2000,"halvings":0,"cell_chars":16384,"cell_head_chars":4096},"cells_cut":0,"cells_raw":0,"read":"whole","date_system":"1900"}

{"sheet":"Geodesie","index":0,"n_rows":26,"n_cols":15,"rows_kept":26,"cut":false,"hidden":false,"merged":[]}
["Paramètres de Base des Géodésique Utilisées",null,"Définition des Paramètres géodésiques"]
[]
["Index",null,null,"Système 1",null,null,null,null,"Index",null,null,"Système 2"]
["Datum:",1,null,"Région & Datum:",{"$f":"(INDEX('Table Datum Shifts'!B15:B203,B4))","v":"Monde / WGS84"},null,null,null,"Datum:",45,null,"Région & Datum:",{"$f":"(INDEX('Table Datum Shifts'!B15:B203,J4))","v":"France / IGN/NTF"},"Projection",{"$f":"INDEX(Projections!C8:C17,J6)","v":"Lambert 1"}]
["Spheroide:",42,null,"Ellipsoïde:",{"$f":"INDEX(Spheroides!C8:C56,B5)","v":"WGS 84"},null,null,null,"Sphéroïde:",42,null,"Ellipsoïde",{"$f":"INDEX(Spheroides!C8:C56,J5)","v":"WGS 84"},"Merid. Ctrl.",{"$f":"INDEX(Projections!E8:E17,J6)","v":2.3372291666666669}]
[null,null,null,"Gd Axe:",{"$f":"INDEX(Spheroides!D8:D56,B5)","v":6378137},null,null,null,"Projection:",1,null,"Gd Axe",{"$f":"INDEX(Spheroides!D8:D56,J5)","v":6378137},"E/W",{"$f":"INDEX(Projections!F8:F17,J6)","v":"E"}]
[null,null,null,"Pt Axe:",{"$f":"INDEX(Spheroides!E8:E56,B5)","v":6356752.3140000002},null,null,null,null,null,null,"Pt Axe",{"$f":"INDEX(Spheroides!E8:E56,J5)","v":6356752.3140000002},"Lat. Or.",{"$f":"INDEX(Projections!G8:G17,J6)","v":49.5}]
[null,null,null,"e2",{"$f":"INDEX(Spheroides!F8:F56,B5)","v":6.6943800667646578E-3},null,null,null,null,null,null,"e2",{"$f":"INDEX(Spheroides!F8:F56,J5)","v":6.6943800667646578E-3},"N/S",{"$f":"INDEX(Projections!H8:H17,J6)","v":"N"}]
[null,null,null,"n",{"$f":"INDEX(Spheroides!G8:G56,B5)","v":1.6792204056685965E-3},null,null,null,null,null,null,"n",{"$f":"INDEX(Spheroides!G8:G56,J5)","v":1.6792204056685965E-3},"Aplat.",{"$f":"INDEX(Projections!I8:I17,J6)","v":0.99987734100000003}]
[null,null,null,"1 / f",{"$f":"INDEX(Spheroides!H8:H56,B5)","v":298.25722014342756},null,null,null,null,null,null,"1 / f",{"$f":"INDEX(Spheroides!H8:H56,J5)","v":298.25722014342756},"Faux E",{"$f":"INDEX(Projections!J8:J17,J6)","v":600000}]
[null,null,null,null,null,null,null,null,null,null,null,null,null,"Faux N",{"$f":"INDEX(Projections!K8:K17,J6)","v":1200000}]
[]
[]
[]
[]
[null,null,null,"Datum Shifts de 1 vers 2"]
[null,null,null,"Dx",168]
[null,null,null,"Dy",60]
[null,null,null,"Dz",-320]
[null,null,null,"Rx",0]
[null,null,null,"Ry",0]
[null,null,null,"Rz",0]
[null,null,null,"ppm",54.74]
[]
["\"+0168,00;+0060,00;-0320,00;-0,000;-0,000;-0,000;+54,740\""]
[{"$f":"INDEX('Table Datum Shifts'!D15:GC203,J4,B4)","v":"\"-0168,00;-0060,00;+0320,00;-0,000;-0,000;-0,000;-54,74\""}]

{"sheet":"Modele","index":1,"n_rows":49,"n_cols":26,"rows_kept":49,"cut":false,"hidden":false,"merged":[]}
["Version du 09/11/97","Position",{"$f":"Geodesie!E4","v":"Monde / WGS84"},null,null,null,null,null,null,"Geographical",null,null,{"$f":"Geodesie!M4","v":"France / IGN/NTF"},null,null,null,null,"Slack","Cable Distance",null,"Cable","Cumulative","Totals","Approx"]
["Christian Auroux","Number",null,null,null,null,null,null,"Heading","Length","Cumul.",null,{"$f":"Geodesie!O4","v":"Lambert 1"},null,null,null,null,"%","Length","Cumul.","Type","by type","By Type","Depth",null,"Comments"]
["geolambshift",null,"Latitude",null,null,"Longitude",null,null,null,"(km)","(km)",null,"Eastings","Northings",null,null,null,null,"(km)","(km)",null,null,"(km)","(m)"]
[]
[null,1,43,7.5092526583775099,{"$f":"IF(OR(C5<0,AND(C5=0,D5<0)),\"S\",\"N\")","v":"N"},1,27.413352850369701,{"$f":"IF(OR(F5<0,AND(F5=0,G5<0)),\"W\",\"E\")","v":"E"},null,null,0,null,{"$f":"GeoLambShiftX(C5,D5,F5,G5)","v":527997.97248730471},{"$f":"GeoLambShiftY(C5,D5,F5,G5)","v":490126.5879863007},null,0,null,null,null,0,null,0,{"$f":"IF(U4=U6,\"\",V5)","v":""}]
[null,null,null,null,null,null,null,null,{"$f":"Cap(C5,D5,F5,G5,C7,D7,F7,G7)","v":44.167282270744778},{"$f":"Distance(C5,D5,F5,G5,C7,D7,F7,G7)","v":2.8728331287599116},null,null,null,null,null,null,null,null,{"$f":"J6*(1+R6/100)","v":2.8728331287599116}]
[null,{"$f":"B5+1","v":2},43,8.6221927378817043,{"$f":"IF(OR(C7<0,AND(C7=0,D7<0)),\"S\",\"N\")","v":"N"},1,28.889456977704,{"$f":"IF(OR(F7<0,AND(F7=0,G7<0)),\"W\",\"E\")","v":"E"},null,null,{"$f":"K5+J6","v":2.8728331287599116},null,{"$f":"GeoLambShiftX(C7,D7,F7,G7)","v":530035.06348819216},{"$f":"GeoLambShiftY(C7,D7,F7,G7)","v":492175.98865935951},null,null,null,null,null,{"$f":"T5+S6","v":2.8728331287599116},null,{"$f":"IF(U6=U4,V5+S6,S6)","v":2.8728331287599116},{"$f":"IF(U6=U8,\"\",V7)","v":""}]
[null,null,null,null,null,null,null,null,{"$f":"Cap(C7,D7,F7,G7,C9,D9,F9,G9)","v":30.030280251917389},{"$f":"Distance(C7,D7,F7,G7,C9,D9,F9,G9)","v":5.8772496578676803},null,null,null,null,null,null,null,null,{"$f":"J8*(1+R8/100)","v":5.8772496578676803}]
[null,{"$f":"B7+1","v":3},43,11.370245538609538,{"$f":"IF(OR(C9<0,AND(C9=0,D9<0)),\"S\",\"N\")","v":"N"},1,31.059635174427999,{"$f":"IF(OR(F9<0,AND(F9=0,G9<0)),\"W\",\"E\")","v":"E"},null,null,{"$f":"K7+J8","v":8.7500827866275923},null,{"$f":"GeoLambShiftX(C9,D9,F9,G9)","v":533050.08091572532},{"$f":"GeoLambShiftY(C9,D9,F9,G9)","v":497260.46712170914},null,null,null,null,null,{"$f":"T7+S8","v":8.7500827866275923},null,{"$f":"IF(U8=U6,V7+S8,S8)","v":8.7500827866275923},{"$f":"IF(U8=U10,\"\",V9)","v":""}]
[null,null,null,null,null,null,null,null,{"$f":"Cap(C9,D9,F9,G9,C11,D11,F11,G11)","v":53.670708949897772},{"$f":"Distance(C9,D9,F9,G9,C11,D11,F11,G11)","v":8.7894950357563744},null,null,null,null,null,null,null,null,{"$f":"J10*(1+R10/100)","v":8.7894950357563744}]
[null,{"$f":"B9+1","v":4},43,14.182449076657804,{"$f":"IF(OR(C11<0,AND(C11=0,D11<0)),\"S\",\"N\")","v":"N"},1,36.288165337805999,{"$f":"IF(OR(F11<0,AND(F11=0,G11<0)),\"W\",\"E\")","v":"E"},null,null,{"$f":"K9+J10","v":17.539577822383968},null,{"$f":"GeoLambShiftX(C11,D11,F11,G11)","v":540224.99543010897},{"$f":"GeoLambShiftY(C11,D11,F11,G11)","v":502423.60450568795},null,null,null,null,null,{"$f":"T9+S10","v":17.539577822383968},null,{"$f":"IF(U10=U8,V9+S10,S10)","v":17.539577822383968},{"$f":"IF(U10=U12,\"\",V11)","v":""}]
[null,null,null,null,null,null,null,null,{"$f":"Cap(C11,D11,F11,G11,C13,D13,F13,G13)","v":38.717845915441529},{"$f":"Distance(C11,D11,F11,G11,C13,D13,F13,G13)","v":14.744573635720256},null,null,null,null,null,null,null,null,{"$f":"J12*(1+R12/100)","v":14.744573635720256}]
[null,{"$f":"B11+1","v":5},43,20.395453007094062,{"$f":"IF(OR(C13<0,AND(C13=0,D13<0)),\"S\",\"N\")","v":"N"},1,43.106316008809998,{"$f":"IF(OR(F13<0,AND(F13=0,G13<0)),\"W\",\"E\")","v":"E"},null,null,{"$f":"K11+J12","v":32.284151458104226},null,{"$f":"GeoLambShiftX(C13,D13,F13,G13)","v":549602.12518093875},{"$f":"GeoLambShiftY(C13,D13,F13,G13)","v":513908.13914368488},null,null,null,null,null,{"$f":"T11+S12","v":32.284151458104226},null,{"$f":"IF(U12=U10,V11+S12,S12)","v":32.284151458104226},{"$f":"IF(U12=U14,\"\",V13)","v":""}]
[null,null,null,null,null,null,null,null,{"$f":"Cap(C13,D13,F13,G13,C15,D15,F15,G15)","v":38.906035284054987},{"$f":"Distance(C13,D13,F13,G13,C15,D15,F15,G15)","v":17.351634864376091},null,null,null,null,null,null,null,null,{"$f":"J14*(1+R14/100)","v":17.351634864376091}]
[null,{"$f":"B13+1","v":6},43,27.687573627530071,{"$f":"IF(OR(C15<0,AND(C15=0,D15<0)),\"S\",\"N\")","v":"N"},1,51.177746395306997,{"$f":"IF(OR(F15<0,AND(F15=0,G15<0)),\"W\",\"E\")","v":"E"},null,null,{"$f":"K13+J14","v":49.635786322480314},null,{"$f":"GeoLambShiftX(C15,D15,F15,G15)","v":560657.19105918275},{"$f":"GeoLambShiftY(C15,D15,F15,G15)","v":527402.53027527872},null,null,null,null,null,{"$f":"T13+S14","v":49.635786322480314},null,{"$f":"IF(U14=U12,V13+S14,S14)","v":49.635786322480314},{"$f":"IF(U14=U16,\"\",V15)","v":""}]
[null,null,null,null,null,null,null,null,{"$f":"Cap(C15,D15,F15,G15,C17,D17,F17,G17)","v":63.16782747516902},{"$f":"Distance(C15,D15,F15,G15,C17,D17,F17,G17)","v":5.8508063817170122},null,null,null,null,null,null,null,null,{"$f":"J16*(1+R16/100)","v":5.8508063817170122}]
[null,{"$f":"B15+1","v":7},43,29.113792817447717,{"$f":"IF(OR(C17<0,AND(C17=0,D17<0)),\"S\",\"N\")","v":"N"},1,55.049263113777002,{"$f":"IF(OR(F17<0,AND(F17=0,G17<0)),\"W\",\"E\")","v":"E"},null,null,{"$f":"K15+J16","v":55.486592704197328},null,{"$f":"GeoLambShiftX(C17,D17,F17,G17)","v":565921.19495832722},{"$f":"GeoLambShiftY(C17,D17,F17,G17)","v":530025.7374110762},null,null,null,null,null,{"$f":"T15+S16","v":55.486592704197328},null,{"$f":"IF(U16=U14,V15+S16,S16)","v":55.486592704197328},{"$f":"IF(U16=U18,\"\",V17)","v":""}]
[null,null,null,null,null,null,null,null,{"$f":"Cap(C17,D17,F17,G17,C19,D19,F19,G19)","v":11.127484382490811},{"$f":"Distance(C17,D17,F17,G17,C19,D19,F19,G19)","v":40.356250241212017},null,null,null,null,null,null,null,null,{"$f":"J18*(1+R18/100)","v":40.356250241212017}]
[null,{"$f":"B17+1","v":8},43,50.497522356529458,{"$f":"IF(OR(C19<0,AND(C19=0,D19<0)),\"S\",\"N\")","v":"N"},2,0.84298969762030995,{"$f":"IF(OR(F19<0,AND(F19=0,G19<0)),\"W\",\"E\")","v":"E"},null,null,{"$f":"K17+J18","v":95.842842945409345},null,{"$f":"GeoLambShiftX(C19,D19,F19,G19)","v":573943.93258391554},{"$f":"GeoLambShiftY(C19,D19,F19,G19)","v":569778.33649712894},null,null,null,null,null,{"$f":"T17+S18","v":95.842842945409345},null,{"$f":"IF(U18=U16,V17+S18,S18)","v":95.842842945409345},{"$f":"IF(U18=U20,\"\",V19)","v":""}]
[null,null,null,null,null,null,null,null,{"$f":"Cap(C19,D19,F19,G19,C21,D21,F21,G21)","v":57.70715792906266},{"$f":"Distance(C19,D19,F19,G19,C21,D21,F21,G21)","v":46.851265833578928},null,null,null,null,null,null,null,null,{"$f":"J20*(1+R20/100)","v":46.851265833578928}]
[null,{"$f":"B19+1","v":9},44,4.0137670733072639,{"$f":"IF(OR(C21<0,AND(C21=0,D21<0)),\"S\",\"N\")","v":"N"},2,30.447601803129999,{"$f":"IF(OR(F21<0,AND(F21=0,G21<0)),\"W\",\"E\")","v":"E"},null,null,{"$f":"K19+J20","v":142.69410877898827},null,{"$f":"GeoLambShiftX(C21,D21,F21,G21)","v":613749.37183902715},{"$f":"GeoLambShiftY(C21,D21,F21,G21)","v":594878.64523432404},null,null,null,null,null,{"$f":"T19+S20","v":142.69410877898827},null,{"$f":"IF(U20=U18,V19+S20,S20)","v":142.69410877898827},{"$f":"IF(U20=U22,\"\",V21)","v":""}]
[null,null,null,null,null,null,null,null,{"$f":"Cap(C21,D21,F21,G21,C23,D23,F23,G23)","v":61.480308322589806},{"$f":"Distance(C21,D21,F21,G21,C23,D23,F23,G23)","v":45.062053889460735},null,null,null,null,null,null,null,null,{"$f":"J22*(1+R22/100)","v":45.062053889460735}]
[null,{"$f":"B21+1","v":10},44,15.631610522237622,{"$f":"IF(OR(C23<0,AND(C23=0,D23<0)),\"S\",\"N\")","v":"N"},3,0.14864295036389,{"$f":"IF(OR(F23<0,AND(F23=0,G23<0)),\"W\",\"E\")","v":"E"},null,null,{"$f":"K21+J22","v":187.75616266844901},null,{"$f":"GeoLambShiftX(C23,D23,F23,G23)","v":653384.96299618972},{"$f":"GeoLambShiftY(C23,D23,F23,G23)","v":616701.99641116988},null,null,null,null,null,{"$f":"T21+S22","v":187.75616266844901},null,{"$f":"IF(U22=U20,V21+S22,S22)","v":187.75616266844901},{"$f":"IF(U22=U24,\"\",V23)","v":""}]
[null,null,null,null,null,null,null,null,{"$f":"Cap(C23,D23,F23,G23,C25,D25,F25,G25)","v":87.443479199183145},{"$f":"Distance(C23,D23,F23,G23,C25,D25,F25,G25)","v":36.98334466394607},null,null,null,null,null,null,null,null,{"$f":"J24*(1+R24/100)","v":36.98334466394607}]
[null,{"$f":"B23+1","v":11},44,16.522364262167315,{"$f":"IF(OR(C25<0,AND(C25=0,D25<0)),\"S\",\"N\")","v":"N"},3,27.912673143549998,{"$f":"IF(OR(F25<0,AND(F25=0,G25<0)),\"W\",\"E\")","v":"E"},null,null,{"$f":"K23+J24","v":224.73950733239508},null,{"$f":"GeoLambShiftX(C25,D25,F25,G25)","v":690454.43883479107},{"$f":"GeoLambShiftY(C25,D25,F25,G25)","v":618799.38135148771},null,null,null,null,null,{"$f":"T23+S24","v":224.73950733239508},null,{"$f":"IF(U24=U22,V23+S24,S24)","v":224.73950733239508},{"$f":"IF(U24=U26,\"\",V25)","v":""}]
[null,null,null,null,null,null,null,null,{"$f":"Cap(C25,D25,F25,G25,C27,D27,F27,G27)","v":67.815195260884821},{"$f":"Distance(C25,D25,F25,G25,C27,D27,F27,G27)","v":32.131881310545864},null,null,null,null,null,null,null,null,{"$f":"J26*(1+R26/100)","v":32.131881310545864}]
[null,{"$f":"B25+1","v":12},44,23.073653933206941,{"$f":"IF(OR(C27<0,AND(C27=0,D27<0)),\"S\",\"N\")","v":"N"},3,50.294706658221997,{"$f":"IF(OR(F27<0,AND(F27=0,G27<0)),\"W\",\"E\")","v":"E"},null,null,{"$f":"K25+J26","v":256.87138864294093},null,{"$f":"GeoLambShiftX(C27,D27,F27,G27)","v":720104.83243136783},{"$f":"GeoLambShiftY(C27,D27,F27,G27)","v":631497.919520583},null,null,null,null,null,{"$f":"T25+S26","v":256.87138864294093},null,{"$f":"IF(U26=U24,V25+S26,S26)","v":256.87138864294093},{"$f":"IF(U26=U28,\"\",V27)","v":""}]
[null,null,null,null,null,null,null,null,{"$f":"Cap(C27,D27,F27,G27,C29,D29,F29,G29)","v":51.944121870861423},{"$f":"Distance(C27,D27,F27,G27,C29,D29,F29,G29)","v":18.151710878862605},null,null,null,null,null,null,null,null,{"$f":"J28*(1+R28/100)","v":18.151710878862605}]
[null,{"$f":"B27+1","v":13},44,29.115327540922209,{"$f":"IF(OR(C29<0,AND(C29=0,D29<0)),\"S\",\"N\")","v":"N"},4,-1.0658141029999999,{"$f":"IF(OR(F29<0,AND(F29=0,G29<0)),\"W\",\"E\")","v":"E"},null,null,{"$f":"K27+J28","v":275.02309952180354},null,{"$f":"GeoLambShiftX(C29,D29,F29,G29)","v":734210.03501007147},{"$f":"GeoLambShiftY(C29,D29,F29,G29)","v":643028.68300416134},null,null,null,null,null,{"$f":"T27+S28","v":275.02309952180354},null,{"$f":"IF(U28=U26,V27+S28,S28)","v":275.02309952180354},{"$f":"IF(U28=U30,\"\",V29)","v":""}]
[null,null,null,null,null,null,null,null,{"$f":"Cap(C29,D29,F29,G29,C31,D31,F31,G31)","v":60.699433713590004},{"$f":"Distance(C29,D29,F29,G29,C31,D31,F31,G31)","v":13.060554607261196},null,null,null,null,null,null,null,null,{"$f":"J30*(1+R30/100)","v":13.060554607261196}]
[null,{"$f":"B29+1","v":14},44,32.566508744383071,{"$f":"IF(OR(C31<0,AND(C31=0,D31<0)),\"S\",\"N\")","v":"N"},4,9.6606717219657003,{"$f":"IF(OR(F31<0,AND(F31=0,G31<0)),\"W\",\"E\")","v":"E"},null,null,{"$f":"K29+J30","v":288.08365412906471},null,{"$f":"GeoLambShiftX(C31,D31,F31,G31)","v":745488.07139736228},{"$f":"GeoLambShiftY(C31,D31,F31,G31)","v":649707.22425838467},null,null,null,null,null,{"$f":"T29+S30","v":288.08365412906471},null,{"$f":"IF(U30=U28,V29+S30,S30)","v":288.08365412906471},{"$f":"IF(U30=U32,\"\",V31)","v":""}]
[null,null,null,null,null,null,null,null,{"$f":"Cap(C31,D31,F31,G31,C33,D33,F33,G33)","v":49.410210448247014},{"$f":"Distance(C31,D31,F31,G31,C33,D33,F33,G33)","v":17.032769202625325},null,null,null,null,null,null,null,null,{"$f":"J32*(1+R32/100)","v":17.032769202625325}]
[null,{"$f":"B31+1","v":15},44,38.550202871453081,{"$f":"IF(OR(C33<0,AND(C33=0,D33<0)),\"S\",\"N\")","v":"N"},4,19.434437127591998,{"$f":"IF(OR(F33<0,AND(F33=0,G33<0)),\"W\",\"E\")","v":"E"},null,null,{"$f":"K31+J32","v":305.11642333169004},null,{"$f":"GeoLambShiftX(C33,D33,F33,G33)","v":758181.91214482998},{"$f":"GeoLambShiftY(C33,D33,F33,G33)","v":661152.23920201045},null,null,null,null,null,{"$f":"T31+S32","v":305.11642333169004},null,{"$f":"IF(U32=U30,V31+S32,S32)","v":305.11642333169004},{"$f":"IF(U32=U34,\"\",V33)","v":""}]
[null,null,null,null,null,null,null,null,{"$f":"Cap(C33,D33,F33,G33,C35,D35,F35,G35)","v":69.015556172991822},{"$f":"Distance(C33,D33,F33,G33,C35,D35,F35,G35)","v":59.797050730080883},null,null,null,null,null,null,null,null,{"$f":"J34*(1+R34/100)","v":59.797050730080883}]
[null,{"$f":"B33+1","v":16},44,50.112245304252667,{"$f":"IF(OR(C35<0,AND(C35=0,D35<0)),\"S\",\"N\")","v":"N"},5,1.7287761055219999,{"$f":"IF(OR(F35<0,AND(F35=0,G35<0)),\"W\",\"E\")","v":"E"},null,null,{"$f":"K33+J34","v":364.9134740617709},null,{"$f":"GeoLambShiftX(C35,D35,F35,G35)","v":813500.49289151118},{"$f":"GeoLambShiftY(C35,D35,F35,G35)","v":684363.92284380551},null,null,null,null,null,{"$f":"T33+S34","v":364.9134740617709},null,{"$f":"IF(U34=U32,V33+S34,S34)","v":364.9134740617709},{"$f":"IF(U34=U36,\"\",V35)","v":""}]
[null,null,null,null,null,null,null,null,{"$f":"Cap(C35,D35,F35,G35,C37,D37,F37,G37)","v":85.731517806570537},{"$f":"Distance(C35,D35,F35,G35,C37,D37,F37,G37)","v":23.723515292616636},null,null,null,null,null,null,null,null,{"$f":"J36*(1+R36/100)","v":23.723515292616636}]
[null,{"$f":"B35+1","v":17},44,51.065596789502621,{"$f":"IF(OR(C37<0,AND(C37=0,D37<0)),\"S\",\"N\")","v":"N"},5,19.682715932851,{"$f":"IF(OR(F37<0,AND(F37=0,G37<0)),\"W\",\"E\")","v":"E"},null,null,{"$f":"K35+J36","v":388.63698935438754},null,{"$f":"GeoLambShiftX(C37,D37,F37,G37)","v":837148.00221274537},{"$f":"GeoLambShiftY(C37,D37,F37,G37)","v":687028.51789314114},null,null,null,null,null,{"$f":"T35+S36","v":388.63698935438754},null,{"$f":"IF(U36=U34,V35+S36,S36)","v":388.63698935438754},{"$f":"IF(U36=U38,\"\",V37)","v":""}]
[null,null,null,null,null,null,null,null,{"$f":"Cap(C37,D37,F37,G37,C39,D39,F39,G39)","v":91.076428543391259},{"$f":"Distance(C37,D37,F37,G37,C39,D39,F39,G39)","v":23.753620777027624},null,null,null,null,null,null,null,null,{"$f":"J38*(1+R38/100)","v":23.753620777027624}]
[null,{"$f":"B37+1","v":18},44,50.824666524449498,{"$f":"IF(OR(C39<0,AND(C39=0,D39<0)),\"S\",\"N\")","v":"N"},5,37.7081115529,{"$f":"IF(OR(F39<0,AND(F39=0,G39<0)),\"W\",\"E\")","v":"E"},null,null,{"$f":"K37+J38","v":412.39061013141514},null,{"$f":"GeoLambShiftX(C39,D39,F39,G39)","v":860968.9208293627},{"$f":"GeoLambShiftY(C39,D39,F39,G39)","v":687574.10841276683},null,null,null,null,null,{"$f":"T37+S38","v":412.39061013141514},null,{"$f":"IF(U38=U36,V37+S38,S38)","v":412.39061013141514},{"$f":"IF(U38=U40,\"\",V39)","v":""}]
[null,null,null,null,null,null,null,null,{"$f":"Cap(C39,D39,F39,G39,C41,D41,F41,G41)","v":89.491474777010595},{"$f":"Distance(C39,D39,F39,G39,C41,D41,F41,G41)","v":22.436582779533211},null,null,null,null,null,null,null,null,{"$f":"J40*(1+R40/100)","v":22.436582779533211}]
[null,{"$f":"B39+1","v":19},44,50.932180637568223,{"$f":"IF(OR(C41<0,AND(C41=0,D41<0)),\"S\",\"N\")","v":"N"},5,54.736081969635002,{"$f":"IF(OR(F41<0,AND(F41=0,G41<0)),\"W\",\"E\")","v":"E"},null,null,{"$f":"K39+J40","v":434.82719291094838},null,{"$f":"GeoLambShiftX(C41,D41,F41,G41)","v":883441.66442747705},{"$f":"GeoLambShiftY(C41,D41,F41,G41)","v":688798.71482767724},null,null,null,null,null,{"$f":"T39+S40","v":434.82719291094838},null,{"$f":"IF(U40=U38,V39+S40,S40)","v":434.82719291094838},{"$f":"IF(U40=U42,\"\",V41)","v":""}]
[null,null,null,null,null,null,null,null,{"$f":"Cap(C41,D41,F41,G41,C43,D43,F43,G43)","v":89.784666293273176},{"$f":"Distance(C41,D41,F41,G41,C43,D43,F43,G43)","v":42.868594330203301},null,null,null,null,null,null,null,null,{"$f":"J42*(1+R42/100)","v":42.868594330203301}]
[null,{"$f":"B41+1","v":20},44,51.019167182451213,{"$f":"IF(OR(C43<0,AND(C43=0,D43<0)),\"S\",\"N\")","v":"N"},6,27.272642125903001,{"$f":"IF(OR(F43<0,AND(F43=0,G43<0)),\"W\",\"E\")","v":"E"},null,null,{"$f":"K41+J42","v":477.69578724115166},null,{"$f":"GeoLambShiftX(C43,D43,F43,G43)","v":926378.33111701743},{"$f":"GeoLambShiftY(C43,D43,F43,G43)","v":691154.15867119003},null,null,null,null,null,{"$f":"T41+S42","v":477.69578724115166},null,{"$f":"IF(U42=U40,V41+S42,S42)","v":477.69578724115166},{"$f":"IF(U42=U44,\"\",V43)","v":""}]
[null,null,null,null,null,null,null,null,{"$f":"Cap(C43,D43,F43,G43,C45,D45,F45,G45)","v":82.676002918018028},{"$f":"Distance(C43,D43,F43,G43,C45,D45,F45,G45)","v":18.339003918634315},null,null,null,null,null,null,null,null,{"$f":"J44*(1+R44/100)","v":18.339003918634315}]
[null,{"$f":"B43+1","v":21},44,52.281405966356402,{"$f":"IF(OR(C45<0,AND(C45=0,D45<0)),\"S\",\"N\")","v":"N"},6,41.080866541109998,{"$f":"IF(OR(F45<0,AND(F45=0,G45<0)),\"W\",\"E\")","v":"E"},null,null,{"$f":"K43+J44","v":496.03479115978598},null,{"$f":"GeoLambShiftX(C45,D45,F45,G45)","v":944463.31050295569},{"$f":"GeoLambShiftY(C45,D45,F45,G45)","v":694519.83006892726},null,null,null,null,null,{"$f":"T43+S44","v":496.03479115978598},null,{"$f":"IF(U44=U42,V43+S44,S44)","v":496.03479115978598},{"$f":"IF(U44=U46,\"\",V45)","v":""}]
[null,null,null,null,null,null,null,null,{"$f":"Cap(C45,D45,F45,G45,C47,D47,F47,G47)","v":88.650545884173312},{"$f":"Distance(C45,D45,F45,G45,C47,D47,F47,G47)","v":19.279655131529562},null,null,null,null,null,null,null,null,{"$f":"J46*(1+R46/100)","v":19.279655131529562}]
[null,{"$f":"B45+1","v":22},44,52.526547702085509,{"$f":"IF(OR(C47<0,AND(C47=0,D47<0)),\"S\",\"N\")","v":"N"},6,55.715883106743,{"$f":"IF(OR(F47<0,AND(F47=0,G47<0)),\"W\",\"E\")","v":"E"},null,null,{"$f":"K45+J46","v":515.31444629131556},null,{"$f":"GeoLambShiftX(C47,D47,F47,G47)","v":963735.66220920184},{"$f":"GeoLambShiftY(C47,D47,F47,G47)","v":696120.57562887017},null,null,null,null,null,{"$f":"T45+S46","v":515.31444629131556},null,{"$f":"IF(U46=U44,V45+S46,S46)","v":515.31444629131556},{"$f":"IF(U46=U48,\"\",V47)","v":""}]
[null,null,null,null,null,null,null,null,{"$f":"Cap(C47,D47,F47,G47,C49,D49,F49,G49)","v":70.308574032413503},{"$f":"Distance(C47,D47,F47,G47,C49,D49,F49,G49)","v":24.960320497397593},null,null,null,null,null,null,null,null,{"$f":"J48*(1+R48/100)","v":24.960320497397593}]
[null,{"$f":"B47+1","v":23},44,57.067436439387933,{"$f":"IF(OR(C49<0,AND(C49=0,D49<0)),\"S\",\"N\")","v":"N"},7,13.572321943087999,{"$f":"IF(OR(F49<0,AND(F49=0,G49<0)),\"W\",\"E\")","v":"E"},null,null,{"$f":"K47+J48","v":540.27476678871312},null,{"$f":"GeoLambShiftX(C49,D49,F49,G49)","v":986730.08535012743},{"$f":"GeoLambShiftY(C49,D49,F49,G49)","v":706021.54417344742},null,null,null,null,null,{"$f":"T47+S48","v":540.27476678871312},null,{"$f":"IF(U48=U46,V47+S48,S48)","v":540.27476678871312},{"$f":"IF(U48=U50,\"\",V49)","v":""}]

{"sheet":"Projections","index":2,"n_rows":39,"n_cols":12,"rows_kept":39,"cut":false,"hidden":true,"merged":[]}
["Parametres de Projection"]
[]
[]
[]
[]
[]
[null,null,"Nom","Ro","Meridien Central","E/W","Lat. Origin","N/S","Applatissement","Easting d'origine","Northing d'origine"]
[null,1,"Lambert 1",5457616.6799999997,2.3372291666666669,"E",49.5,"N",0.99987734100000003,600000,1200000]
[null,2,"Lambert 2",5999695.7699999996,2.3372291666666669,"E",46.8,"N",0.99987742000000002,600000,2200000]
[null,3,"Lambert 3",6591905.0800000001,2.3372291666666669,"E",44.1,"N",0.999877499,600000,3200000]
[null,4,"Lambert 4",7053300.1799999997,2.3372291666666669,"E",42.164999999999999,"N",0.99994470999999996,234.358,4185861.3689999999]
[null,5]
[null,6]
[null,7]
[null,8]
[null,9]
[null,10]
[]
[]
[null,"Meridien Central et Latitude d'origine en Degres"]
[]
[]
[]
[]
[]
[]
[]
[]
[]
[]
[]
[]
[]
[]
[]
[]
[]
[]
[null,null,null,null,null,null,null,null,null,null,null,"C Bunn June 1995"]

{"sheet":"Spheroides","index":4,"n_rows":56,"n_cols":8,"rows_kept":56,"cut":false,"hidden":false,"merged":[]}
["Liste des Ellipsoides Disponibles"]
[]
[]
[]
[]
[]
[null,null,"Nom","Demi Grand","Demi Petit","e2","n","1 / f"]
[null,1,"AIRY",6377563.3959999997,6356256.909,{"$f":"POWER(1/D8*(SQRT((D8*D8)-(E8*E8))),2)","v":6.6705400741490836E-3},1.6732202503250534E-3,{"$f":"1/((D8-E8)/D8)","v":299.32496126649505}]
[null,2,"AIRY MOD",6377340.1890000002,6356034.4479999999,6.6705399807736503E-3,1.6732203054869081E-3,299.32496546352854]
[null,3,"AUSTRALIAN NATIONAL 1967/84",6378160,6356774.7189999996,6.694541915624532E-3,null,{"$f":"1/((D10-E10)/D10)","v":298.24999727615801}]
[null,4,"BESSEL 1841",6377397.1550000003,6356078.9630000005,6.6743721749749326E-3,1.6741847868128074E-3,299.15281535132334]
[null,5,"BESSEL 1841 MOD",6377483.8650000002,6356165.3830000004,6.6743722212770787E-3,1.6741847984660181E-3,299.15281327254201]
[null,6,"BESSEL NGO",6377492.0180000002,6356173.5089999996,6.6743721420039794E-3,null,299.152816831601]
[null,7,"BESSEL RD / POTSDAM",6377397.1550000003,6356078.9630000005,6.6743721749749326E-3,null,299.15281535132334]
[null,8,"BROADCAST",6378135,6356750.5199999996,6.6943177832963279E-3,null,298.25999977553192]
[null,9,"CLARKE 1856",6378235.5999999996,6356560.1399999997,6.785145919996286E-3,null,294.26068005015861]
[null,10,"CLARKE 1866",6378206.4000000004,6356583.7999999998,6.7686579972911819E-3,1.6979156829769022E-3,294.97869821389821]
[null,11,"CLARKE 1880",6378249.1449999996,6356514.8700000001,6.8035111421552033E-3,1.7066884768653044E-3,293.46500607911531]
[null,12,"CLARKE 1880 IGN",6378249.2000000002,6356515,{"$f":"POWER(1/D19*(SQRT((D19*D19)-(E19*E19))),2)","v":6.8034876462998934E-3},null,293.46602129362691]
[null,13,"CLARKE 1880 MOD",6378249.1449999996,6356514.8700000001,{"$f":"POWER(1/D20*(SQRT((D20*D20)-(E20*E20))),2)","v":6.8035111421552033E-3},1.7066884768653044E-3,293.46500607911531]
[null,14,"CLARKE 1880 (PALESTINE)",6378300.7819999997,6356566.4270000001,{"$f":"POWER(1/D21*(SQRT((D21*D21)-(E21*E21))),2)","v":6.803481156342152E-3},null,293.46630171450414]
[null,15,"DANISH 1876  / ANDRAE",6377104.4299999997,6355847.415,6.6555556284901502E-3,null,299.99999670697417]
[null,16,"EVEREST (INDE) METRIQUE",6377301.2429999998,6356100.2300000004,6.6378461201175376E-3,null,300.80172315352098]
[null,17,"EVEREST (MALAYA)",6377295.6639999999,6356094.6679999996,6.637846603695206E-3,null,{"$f":"1/((D24-E24)/D24)","v":300.80170120309049}]
[null,18,"EVEREST 1830",6377276.3449999997,6356075.4129999997,6.6378466740345783E-3,1.6649922505031004E-3,300.80169801025681]
[null,19,"EVEREST 1830 (MOD.)",6377298.5609999998,6356097.5549999997,6.6378467190551368E-3,null,300.80169596669066]
[null,20,"EVEREST BORNEO",6377298.5559999999,6356097.5549999997,6.6378451614016471E-3,null,300.80176667129774]
[null,21,"EVEREST MOD.",6377304.0630000001,6356103.0389999999,6.6378466280601449E-3,null,300.80170009712441]
[null,22,"FISHER 1960 (MERCURY)",6378166,6356784.284,6.6934215001796154E-3,null,298.30000548131846]
[null,23,"FISHER 1968",6378150,6356768.3370000003,6.6934216993408307E-3,null,298.29999659054056]
[null,24,"FISCHER MOD",6378160,6356774.7189999996,6.694541915624532E-3,1.6792611404669755E-3,298.24999727615801]
[null,25,"FISHER MOD. 1960",6378155,6356773.3200000003,6.6934217738298723E-3,null,298.29999326526678]
[null,26,"GRS 67",6378160,6356774.5159999998,6.694605356917795E-3,null,298.24716616186703]
[null,27,"GRS 80",6378137,6356752.3140000002,6.6943800667646578E-3,null,298.25722014342756]
[null,28,"HELMERT 1906",6378200,6356818,6.6934746345492999E-3,1.6789925228217189E-3,298.29763352352444]
[null,29,"HOUGH",6378270,6356794.3430000003,6.7226701580694282E-3,1.6863406749730355E-3,296.99999399320365]
[null,30,"INTERNATIONAL",6378388,6356911.9460000005,{"$f":"POWER(1/D37*(SQRT((D37*D37)-(E37*E37))),2)","v":6.7226700623166684E-3},1.6863406508729228E-3,296.9999982305938]
[null,31,"JEFFREYS 1948",6378099,6356631,6.7204571463943836E-3,null,297.09795975405251]
[null,32,"KRASSOVSKY",6378245,6356863,6.6934274898192208E-3,1.6789806572508061E-3,298.29973809746514]
[null,33,"PRECISE",6378145,6356759.7690000003,6.6945420073107756E-3,1.6792611635429559E-3,{"$f":"1/((D40-E40)/D40)","v":298.2499931845532}]
[null,34,"REF ELLIPSOIDE 1967",6378160,6356774.7189999996,6.694541915624532E-3,1.6792611404669755E-3,298.24999727615801]
[null,35,"S AMERICA 1969",6378160,6356774.7189999996,6.694541915624532E-3,1.6792611404669755E-3,298.24999727615801]
[null,36,"STRUVE 1860",6378298.2999999998,6356657.1430000002,6.7743596975477745E-3,null,294.73000450022613]
[null,37,"SVANBERG",6376797,6355837.9709999999,6.5627258654816379E-3,null,304.25059290675966]
[null,38,"WAR OFFICE 1924",6378300,6356751.6890000002,6.7453433754114476E-3,null,295.99999740119182]
[null,39,"WGS 60",6378165,6356783.2869999995,6.6934216102894064E-3,null,298.30000056589779]
[null,40,"WGS 66",6378145,6356759.7690000003,6.6945420073107756E-3,null,298.2499931845532]
[null,41,"WGS 72",6378135,6356750.5199999996,6.6943177832963279E-3,1.6792047299063939E-3,298.25999977553192]
[null,42,"WGS 84",6378137,6356752.3140000002,6.6943800667646578E-3,1.6792204056685965E-3,298.25722014342756]
[null,43]
[null,44]
[null,45]
[null,46]
[]
[]
[null,null," "]

{"sheet":"Table Datum Shifts","index":5,"n_rows":203,"n_cols":186,"rows_kept":203,"cut":false,"hidden":false,"merged":[]}
["Datum System 1",null,"\"-0000,00;+0125,00;+0194,00;-0,000;-0,000;-0,000;-0,000\""]
["Datum System 2",null,"\"+0000,00;+0012,00;+0006,00;-0,000;-0,000;-0,000;+0,031\""]
[null,null,{"$f":"MID(C1,2,8)","v":"-0000,00"},{"$f":"MID(C1,11,8)","v":"+0125,00"},{"$f":"MID(C1,20,8)","v":"+0194,00"},{"$f":"MID(C1,29,6)","v":"-0,000"},{"$f":"MID(C1,36,6)","v":"-0,000"},{"$f":"MID(C1,43,6)","v":"-0,000"},{"$f":"MID(C1,50,6)","v":"-0,000"}]
[null,null,{"$f":"MID(C2,2,8)","v":"+0000,00"},{"$f":"MID(C2,11,8)","v":"+0012,00"},{"$f":"MID(C2,20,8)","v":"+0006,00"},{"$f":"MID(C2,29,6)","v":"-0,000"},{"$f":"MID(C2,36,6)","v":"-0,000"},{"$f":"MID(C2,43,6)","v":"-0,000"},{"$f":"MID(C2,50,6)","v":"+0,031"}]
[null,null,{"$f":"C3-C4","v":0},113,188,0,0,0,-3.1E-2]
[null,null,{"$f":"ABS(C5)","v":0},113,188,0,0,0,3.1E-2]
[null,null,{"$f":"TEXT(C6,\"0000,00\")","v":"0000,00"},{"$f":"TEXT(D6,\"0000,00\")","v":"0113,00"},{"$f":"TEXT(E6,\"0000,00\")","v":"0188,00"},{"$f":"TEXT(F6,\"0,000\")","v":"0,000"},{"$f":"TEXT(G6,\"0,000\")","v":"0,000"},{"$f":"TEXT(H6,\"0,000\")","v":"0,000"},{"$f":"TEXT(I6,\"0,000\")","v":"0,031"}]
[null,null,{"$f":"IF(C5>0,CONCATENATE(\"+\",C7),CONCATENATE(\"-\",C7))","v":"-0000,00"},"+0113,00","+0188,00","-0,000","-0,000","-0,000","-0,031"]
[null,null,{"$f":"CONCATENATE(\"\"\"\",C8,\";\")","v":"\"-0000,00;"},{"$f":"CONCATENATE(D8,\";\")","v":"+0113,00;"},{"$f":"CONCATENATE(E8,\";\")","v":"+0188,00;"},{"$f":"CONCATENATE(F8,\";\")","v":"-0,000;"},{"$f":"CONCATENATE(G8,\";\")","v":"-0,000;"},{"$f":"CONCATENATE(H8,\";\")","v":"-0,000;"},{"$f":"CONCATENATE(I8,\"\"\"\")","v":"-0,031\""}]
["Datum Calcule",null,{"$f":"CONCATENATE(C9,D9,E9,F9,G9,H9,I9)","v":"\"-0000,00;+0113,00;+0188,00;-0,000;-0,000;-0,000;-0,031\""}]
[]
[null,null,null,"Vers","Vers","Vers","Vers","Vers","Vers","Vers","Vers","Vers","Vers","Vers","Vers","Vers","Vers","Vers","Vers","Vers","Vers","Vers","Vers","Vers",null,"Vers","Vers","Vers","Vers",null,"Vers","Vers","Vers","Vers",null,"Vers","Vers","Vers","Vers","Vers",null,"Vers","Vers","Vers","Vers",null,"Vers","Vers","Vers","Vers","Vers","Vers",null,"Vers","Vers","Vers","Vers","Vers","Vers","Vers","Vers","Vers",null,"Vers",null,"Vers",null,null,null,null,"Vers",null,null,"Vers",null,"Vers",null,"Vers","Vers","Vers",null,"Vers","Vers","Vers","Vers",null,"Vers","Vers","Vers","Vers",null,"Vers","Vers",null,null,null,"Vers","Vers","Vers","Vers","Vers","Vers",null,"Vers",null,null,null,"Vers","Vers","Vers","Vers","Vers",null,null,null,"Vers",null,"Vers","Vers","Vers","Vers","Vers","Vers","Vers","Vers","Vers","Vers","Vers","Vers","Vers","Vers","Vers","Vers","Vers",null,"Vers","Vers","Vers","Vers","Vers",null,"Vers","Vers","Vers","Vers","Vers","Vers","Vers",null,"Vers","Vers","Vers",null,"Vers","Vers","Vers","Vers","Vers","Vers","Vers","Vers","Vers","Vers","Vers","Vers","Vers","Vers","Vers","Vers","Vers",null,"Vers","Vers","Vers","Vers","Vers","Vers","Vers","Vers","Vers","Vers","Vers","Vers","Vers"]
[null,null,"Zone / Datum","Monde / WGS84","Afrique du Sud / S Africa Cape","Alaska / NAD27","Alaska / NAD27","Alaska / NAD83","Amerique Central / NAD83","Arabie Saoudite / Nahrwan","Argentine / Campo Inchauste","Argentine / S. America 1969","Australie / Australian Geodetic 1966","Australie / Australian Nat","Australie / Autralian","Bahrain / Ain El Abl 1970","Bangladesh / Indian","Belize / NAD27","Bolivie / Prov. S America 1956","Bolivie / S. America 1969","Botswana / Cape Arc 1950","Bresil / S. America 1969","Brunei / Timbalai","Canada / NAD27","Canada / NAD27 (Canada)","Canal Panama / NAD27","Chili / Prov. S Chilean 63","Chili / S. America 1969","Chypre / ED50","Colombie / Bogota Observatory","Colombie / Prov. S America 1956","Colombie / S. America 1969","Corée / Tokyo","Egypte / ED50","Egypte / Old Egyptian","Emirats Arabes Unifies / Nahrwan","Equateur / Prov. S American 1956","Equateur / S American 1969","Erytree / Massawa","Espagne / ED50","Espiranto Santos / Santo (DOS)","Ethiopie / Adindan","Europe / ED50","Europe / ED87","Finlande / ED50","France / ED50 IGN","France / ED79 France","France / IGN/NTF","France / WGS72 France","Gabon / M'Paraloko","Gizo / Gizo DOS 1968","Grece / ED50","Groenland / NAD27","Groenland / Qornoq","Guatemala / NAD27","Guyana / Prov. S American 1956","Guyana / S American 1969","Honduras / NAD27","Hong Kong / Hong Kong 1963","Icelande / Hjorsey 1955","Ile d'Efate et Erromango / Bellevue (IGN)","Ile d'Oahu / ?","Ile de Costa Rica / NAD27","Ile de Cuba / NAD27","Ile de Guam / Guam 1963","Ile de Kerguelen / Kerguelen","Ile de l'Ascension / Ascension 1958","Ile de la Barbades / NAD27","Ile de la Jamaique / NAD27","Ile de Madere / SE Base","Ile de Sao Miguel / Sao Braz","Ile de Sardaigne / ED50","Ile de Sardaigne / Rome 1940","Ile de Sicile / ED50","Ile de Tern / Asrto B4","Ile Diego Garcia / ISTS 073 Astro 1969","Ile Dominique / NAD27","Ile Georgia / DOS 1968","Ile Grand Cayman / NAD27","Ile Guadalcanal / Gux 1 Astro","Ile Hawaii / Old Hawaiian","Ile Hawaii Kauai / Old Hawaiian","Ile Hawaii Maui / Old Hawaiian","Ile Hawaii Oahu / Old Hawaiian","Ile Iwo Jima / Astro Beacon East","Ile Johnson / Johnson Is 1961","Ile Mahe / Ile Mahe 1971","Ile Marcus / Asrto Stn 1952","Ile Pitcairn / Pitcairn Astro 1967","Ile Saint Helene / Astro DOS 7","Ile Santa Maria / Sao Braz","Ile Tristan da Cunha / Tristan Astro","Ile Viti Levu / Viti Levu 1916","Iles Bahamas / Cape Canaveral","Iles Bahamas / NAD27","Iles Caicos / NAD27","Iles Caiman / LC 5 Astro","Iles Canaries / Pico de las Nieves","Iles Chatam / Ile Chatam 1971","Iles Cocos / Australian","Iles de Mascarenes / Reunion","Iles de Midway / Midway Astro 1961","Iles de Paques / Iles de Paques 1967","Iles des Açores / Observatorio 1966","Iles des Açores / SW Base","Iles des Bermudes / Bermuda 1957","Iles Falklands / Sapper Hill 1943","Iles Maldives / Gandajika Base","Iles Marshall / Wake Eniwetok 1960","Iles Phoenix / Canton Astro 1966","Iles Salvages / Marco Astro","Iles Sous le Vent / NAD27","Iles Trinité & Tobago / Naparima (BWI)","Iles Trinité & Tobago / S. American 1969","Iles Vierges / Puerto Rico","Iran / ED50","Irelande / Ireland 1965","Japon / Tokyo","Kenya / Cape Arc 1950","Lesoto / Cape Arc 1950","Liberia / Liberia 1964","Malaisie (Est) / Timbalia","Malaisie (Ouest) / Kertau 1948","Malawi / Cape Arc 1950","Mali / Adindan","Maroc / Merchich","Maui / Maui","Mexique / NAD27","Mindanao / Luzon","Monde / DOPLER","Monde / NWL 10D","Monde / NWL 9D","Monde / WGS 72","Monde / WGS84 SEA","Namibie / Schwarzeck","Neherlandes / RD","Nepal / Indian","Nicaragua / NAD27","Nigeria / Minna","Norvège / ED50","Nouvelles Zelandes / GD 1949","Oman / Oman","Paraguay / Chua Astro","Paraguay / S American 1969","Perou / Prov S American 1956","Perou / S American 1969","Phillipines / Luzon 1911","Portugal / ED50","Puerto Rico / Puerto Rico","Qatar / Nahrwan","Qatar / Nahrwan Maersk","Qatar / Qatar National","Royaume Uni / DOPPLER","Royaume Uni / ED50","Royaume Uni / OS(SN)80","Russie / Pulkovo","Russie / WGS72","Sabah / Timbalai 1948","San Salvador / NAD27","Sarawak / Timbalai 1948","Senegal / Adindan","Singapour / Kertau 1948","Singapour / Kertau 1948","Singapour / South Asia","Somalie / Afgooye","Soudan / Adindan","Sri Lanka / Kandawala","Sumatra / Djakarta (Batavia)","Surinam / Zanderij","Swaziland / Cape Arc 1950","Tanzanie / Cale Arc 1950","Tasmanie / Australian National","Thailande / Indian","Thailande / Moattama","Tunisie / Carthage","Turquie / NAD27","USA / NAD27 (CONUS)","Venezuela / Prov. S. American 1956","Venezuela / S. American 1969","Vietnam / Indian","Zaire / Cape Arc 1950","Zambie / Cape Arc 1950","Zimbabwe / Cape Arc 1950"," / "," / "," / "]
[null,"Zone / Datum","Spheroide","WGS84","Clarke 1880 Mod.","Clarke 1866","Clarke 1866","GRS80","GRS80","Clarke 1880 Mod.","International","S America 1969","RE 1967","RE 1967","RE 1984","International","Everest 1830","Clarke 1866","International","S. America 1969","Clarke 1880 Mod.","S. America 1969","Everest 1830","Clarke 1866","Clarke 1866","Clarke 1866","International","S. America 1969","International","International","International","S. America 1969","Bessel 1841","International","Helmert 1906","Clarke 1880 Mod","International","S American 1969","Bessel 1841","International","International","Clarke 1880 Mod","International","International","International","International","International","Clarke 1880 (IGN)","WGS72","Clarke 1880","International","International","Clarke 1866","International","Clarke 1866","International","S American","Clarke 1866","International","International","International","Clarke 1866","Clarke 1866","Clarke 1866","Clarke 1966","International","International","Clarke 1866","Clarke 1866","International","International","International","International","International","International","International","Clarke 1866","International","Clarke 1866","International","Clarke 1866","Clarke 1866","Clarke 1866","Clarke 1866","International","International","Clarke 1880 Mod","International","International","International","International","International","Clarke 1880 Mod","Clarke 1866","Clarke 1866","Clarke 1866","Clarke 1866","International","International","RE 1967","International","International","International","International","International","Clarke 1866","International","International","Hough","International","International","Clarke 1866","International","S. American 1969","Clarke 1866","International","Airy Mod","Bessel 1841","Clarke 1880 Mod","Clarke 1880 Mod","Clarke 1880 Mod","Everest 1830","Everest Mod","Clarke 1880 Mod","Clarke 1880 Mod","Clarke 1880 Mod","Clarke 1866","Clarke 1866","Clarke 1866","Precise","NWL 10D","NWL 9D","WGS 72","WGS84","Bessel 1841 Mod","Bessel RD","Everst 1830","Clarke 1866","Clarke 1880 Mod","International","International","Clarke 1880 Mod","International","S American 1969","International","S American 1969","Clarke 1866","International","Clarke 1866","Clarke 1880 Mod","Clarke 1880 Mod","International","Precise","International","Airy","Krassovsky","WGS72","Everest 1830","Clarke 1866","Everst 1830","Clarke 1880 Mod","Everest Mod","Everest 1830","Fisher Mod","Krassovsky","Clarke 1880 Mod","Everest 1830","Bessel 1841","International","Clarke 1880 Mod","Clarke 1880 Mod","RE 1967","Everest 1830","WGS84","Clarke 1880 Mod","Clarke 1866","Clarke 1866","International","S. American 1969","Everest 1830","Clarke 1880 Mod","Clarke 1880 Mod","Clarke 1880 Mod"]
["Depuis","Monde / WGS84","WGS84","\"-0000,00;-0000,00;-0000,00;-0,000;-0,000;-0,000;-0,000\"","\"+0136,00;+0108,00;+0292,00;-0,000;-0,000;-0,000;-0,000\"","\"+0012,62;-0156,56;-0180,52;-0,000;-0,000;-0,814;-0,427\"","\"+0005,00;-0135,00;-0172,00;-0,000;-0,000;-0,000;-0,000\"","\"-0000,00;-0000,00;-0000,00;-0,000;-0,000;-0,000;-0,000\"","\"-0000,00;-0000,00;-0000,00;-0,000;-0,000;-0,000;-0,000\"","\"+0231,00;+0196,00;-0482,00;-0,000;-0,000;-0,000;-0,000\"","\"+0148,00;-0136,00;-0090,00;-0,000;-0,000;-0,000;-0,000\"","\"+0057,00;-0001,00;+0041,00;-0,000;-0,000;-0,000;-0,000\"","\"+0133,00;+0048,00;-0148,00;-0,000;-0,000;-0,000;-0,000\"","\"+0122,00;+0041,00;-0150,00;-0,000;-0,000;-0,554;-0,227\"","\"+0134,00;+0048,00;-0149,00;-0,000;-0,000;-0,000;-0,000\"","\"+0150,00;+0251,00;+0002,00;-0,000;-0,000;-0,000;-0,000\"","\"-0289,00;-0734,00;-0257,00;-0,000;-0,000;-0,000;-0,000\"","\"-0000,00;-0125,00;-0194,00;-0,000;-0,000;-0,000;-0,000\"","\"+0288,00;-0175,00;+0376,00;-0,000;-0,000;-0,000;-0,000\"","\"+0057,00;-0001,00;+0041,00;-0,000;-0,000;-0,000;-0,000\"","\"+0138,00;+0105,00;+0289,00;-0,000;-0,000;-0,000;-0,000\"","\"+0057,00;-0001,00;+0041,00;-0,000;-0,000;-0,000;-0,000\"","\"+0689,00;-0691,00;+0046,00;-0,000;-0,000;-0,000;-0,000\"","\"+0010,00;-0158,00;-0187,00;-0,000;-0,000;-0,000;-0,000\"","\"+0009,00;-0139,00;-0177,50;-0,000;-0,000;-0,554;-0,227\"","\"-0000,00;-0125,00;-0201,00;-0,000;-0,000;-0,000;-0,000\"","\"-0016,00;-0196,00;-0093,00;-0,000;-0,000;-0,000;-0,000\"","\"+0057,00;-0001,00;+0041,00;-0,000;-0,000;-0,000;-0,000\"","\"+0104,00;+0101,00;+0140,00;-0,000;-0,000;-0,000;-0,000\"","\"-0307,00;-0304,00;+0318,00;-0,000;-0,000;-0,000;-0,000\"","\"+0288,00;-0175,00;+0376,00;-0,000;-0,000;-0,000;-0,000\"","\"+0057,00;-0001,00;+0041,00;-0,000;-0,000;-0,000;-0,000\"","\"+0128,00;-0481,00;-0664,00;-0,000;-0,000;-0,000;-0,000\"","\"+0130,00;+0117,00;+0151,00;-0,000;-0,000;-0,000;-0,000\"","\"+0130,00;-0110,00;+0013,00;-0,000;-0,000;-0,000;-0,000\"","\"+0249,00;+0156,00;-0381,00;-0,000;-0,000;-0,000;-0,000\"","\"+0288,00;-0175,00;+0376,00;-0,000;-0,000;-0,000;-0,000\"","\"+0057,00;-0001,00;+0041,00;-0,000;-0,000;-0,000;-0,000\"","\"-0639,00;-0405,00;-0060,00;-0,000;-0,000;-0,000;-0,000\"","\"+0088,00;+0109,00;+0122,00;-0,000;-0,000;-0,000;-0,000\"","\"-0170,00;-0042,00;-0084,00;-0,000;-0,000;-0,000;-0,000\"","\"+0165,00;+0011,00;-0206,00;-0,000;-0,000;-0,000;-0,000\"","\"+0089,50;+0093,80;+0123,10;-0,000;-0,000;+0,156;-1,200\"","\"+0083,11;+0097,38;+0117,23;+0,006;+0,045;-0,044;-0,122\"","\"+0087,00;+0095,00;+0120,00;-0,000;-0,000;-0,000;-0,000\"","\"+0084,00;+0097,00;+0117,00;-0,000;-0,000;-0,000;+14,190\"","\"+0083,00;+0095,00;+0116,00;-0,000;-0,000;-0,000;+14,190\"","\"+0168,00;+0060,00;-0320,00;-0,000;-0,000;-0,000;+54,740\"","\"-0000,00;-0012,00;-0006,00;-0,000;-0,000;-0,000;-0,031\"","\"+0077,90;+0132,90;-0043,70;-0,000;-0,000;-0,000;-0,000\"","\"-0230,00;+0199,00;+0752,00;-0,000;-0,000;-0,000;-0,000\"","\"+0084,00;+0095,00;+0130,00;-0,000;-0,000;-0,000;-0,000\"","\"-0011,00;-0114,00;-0195,00;-0,000;-0,000;-0,000;-0,000\"","\"-0164,00;-0138,00;+0189,00;-0,000;-0,000;-0,000;-0,000\"","\"-0000,00;-0125,00;-0194,00;-0,000;-0,000;-0,000;-0,000\"","\"+0288,00;-0175,00;+0376,00;-0,000;-0,000;-0,000;-0,000\"","\"+0057,00;-0001,00;+0041,00;-0,000;-0,000;-0,000;-0,000\"","\"-0000,00;-0125,00;-0194,00;-0,000;-0,000;-0,000;-0,000\"","\"+0156,00;+0271,00;+0189,00;-0,000;-0,000;-0,000;-0,000\"","\"+0073,00;-0046,00;+0086,00;-0,000;-0,000;-0,000;-0,000\"","\"+0127,00;+0769,00;-0472,00;-0,000;-0,000;-0,000;-0,000\"","\"-0056,00;+0268,00;+0182,50;-0,000;-0,000;-0,554;-0,227\"","\"-0000,00;-0125,00;-0194,00;-0,000;-0,000;-0,000;-0,000\"","\"+0007,00;-0152,00;-0178,00;-0,000;-0,000;-0,000;-0,000\"","\"-0252,00;+0209,00;+0751,00;-0,000;-0,000;-0,000;-0,000\"","\"-0145,00;+0187,00;-0103,00;-0,000;-0,000;-0,000;-0,000\"","\"+0207,00;-0107,00;-0052,00;-0,000;-0,000;-0,000;-0,000\"","\"+0007,00;-0152,00;-0178,00;-0,000;-0,000;-0,000;-0,000\"","\"+0007,00;-0152,00;-0178,00;-0,000;-0,000;-0,000;-0,000\"","\"+0499,00;+0249,00;-0314,00;-0,000;-0,000;-0,000;-0,000\"","\"+0203,00;-0141,00;-0053,00;-0,000;-0,000;-0,000;-0,000\"","\"+0097,00;+0103,00;+0120,00;-0,000;-0,000;-0,000;-0,000\"","\"+0255,00;+0065,00;-0009,00;-0,000;-0,000;-0,000;-0,000\"","\"+0097,00;+0088,00;+0135,00;-0,000;-0,000;-0,000;-0,000\"","\"-0114,00;+0116,00;+0333,00;-0,000;-0,000;-0,000;-0,000\"","\"-0208,00;+0435,00;+0229,00;-0,000;-0,000;-0,000;-0,000\"","\"+0007,00;-0152,00;-0178,00;-0,000;-0,000;-0,000;-0,000\"","\"-0230,00;+0199,00;+0752,00;-0,000;-0,000;-0,000;-0,000\"","\"+0007,00;-0152,00;-0178,00;-0,000;-0,000;-0,000;-0,000\"","\"-0252,00;+0209,00;+0751,00;-0,000;-0,000;-0,000;-0,000\"","\"-0089,00;+0279,00;+0183,00;-0,000;-0,000;-0,000;-0,000\"","\"-0045,00;+0290,00;+0172,00;-0,000;-0,000;-0,000;-0,000\"","\"-0065,00;+0290,00;+0190,00;-0,000;-0,000;-0,000;-0,000\"","\"-0056,00;+0284,00;+0181,00;-0,000;-0,000;-0,000;-0,000\"","\"-0145,00;-0075,00;+0272,00;-0,000;-0,000;-0,000;-0,000\"","\"-0191,00;+0077,00;+0204,00;-0,000;-0,000;-0,000;-0,000\"","\"-0041,00;+0220,00;+0134,00;-0,000;-0,000;-0,000;-0,000\"","\"-0124,00;+0234,00;+0025,00;-0,000;-0,000;-0,000;-0,000\"","\"-0185,00;-0165,00;-0042,00;-0,000;-0,000;-0,000;-0,000\"","\"+0320,00;-0550,00;+0494,00;-0,000;-0,000;-0,000;-0,000\"","\"+0203,00;-0141,00;-0053,00;-0,000;-0,000;-0,000;-0,000\"","\"+0632,00;-0438,00;+0609,00;-0,000;-0,000;-0,000;-0,000\"","\"-0051,00;-0391,00;+0036,00;-0,000;-0,000;-0,000;-0,000\"","\"+0002,00;-0150,00;-0181,00;-0,000;-0,000;-0,000;-0,000\"","\"+0004,00;-0154,00;-0178,00;-0,000;-0,000;-0,000;-0,000\"","\"+0007,00;-0152,00;-0178,00;-0,000;-0,000;-0,000;-0,000\"","\"-0042,00;-0124,00;-0147,00;-0,000;-0,000;-0,000;-0,000\"","\"+0307,00;+0092,00;-0127,00;-0,000;-0,000;-0,000;-0,000\"","\"-0175,00;+0038,00;-0113,00;-0,000;-0,000;-0,000;-0,000\"","\"+0491,00;+0022,00;-0435,00;-0,000;-0,000;-0,000;-0,000\"","\"-0094,00;+0948,00;+1262,00;-0,000;-0,000;-0,000;-0,000\"","\"-0912,00;+0058,00;-1227,00;-0,000;-0,000;-0,000;-0,000\"","\"-0211,00;-0147,00;-0111,00;-0,000;-0,000;-0,000;-0,000\"","\"+0425,00;+0169,00;-0081,00;-0,000;-0,000;-0,000;-0,000\"","\"+0104,00;-0167,00;+0038,00;-0,000;-0,000;-0,000;-0,000\"","\"+0073,00;-0213,00;-0296,00;-0,000;-0,000;-0,000;-0,000\"","\"+0355,00;-0016,00;-0074,00;-0,000;-0,000;-0,000;-0,000\"","\"+0133,00;+0321,00;-0050,00;-0,000;-0,000;-0,000;-0,000\"","\"-0101,00;-0052,00;+0039,00;-0,000;-0,000;-0,000;-0,000\"","\"-0298,00;+0304,00;+0375,00;-0,000;-0,000;-0,000;-0,000\"","\"+0289,00;+0124,00;-0060,00;-0,000;-0,000;-0,000;-0,000\"","\"+0007,00;-0152,00;-0178,00;-0,000;-0,000;-0,000;-0,000\"","\"+0002,00;-0374,00;-0172,00;-0,000;-0,000;-0,000;-0,000\"","\"+0057,00;-0001,00;+0041,00;-0,000;-0,000;-0,000;-0,000\"","\"-0011,00;-0072,00;+0101,00;-0,000;-0,000;-0,000;-0,000\"","\"+0117,00;+0132,00;+0164,00;-0,000;-0,000;-0,000;-0,000\"","\"-0506,00;+0122,00;-0611,00;-0,000;-0,000;-0,000;-0,000\"","\"+0128,00;-0481,00;-0664,00;-0,000;-0,000;-0,000;-0,000\"","\"+0161,00;+0007,00;+0300,00;-0,000;-0,000;-0,000;-0,000\"","\"+0125,00;+0108,00;+0295,00;-0,000;-0,000;-0,000;-0,000\"","\"+0090,00;-0040,00;-0088,00;-0,000;-0,000;-0,000;-0,000\"","\"+0689,00;-0691,00;+0046,00;-0,000;-0,000;-0,000;-0,000\"","\"+0011,00;-0851,00;-0005,00;-0,000;-0,000;-0,000;-0,000\"","\"+0161,00;+0073,00;+0317,00;-0,000;-0,000;-0,000;-0,000\"","\"+0163,00;+0020,00;-0220,00;-0,000;-0,000;-0,000;-0,000\"","\"-0031,00;-0146,00;-0047,00;-0,000;-0,000;-0,000;-0,000\"","\"-0065,00;+0272,00;+0192,50;-0,000;-0,000;-0,554;-0,227\"","\"+0012,00;-0130,00;-0190,00;-0,000;-0,000;-0,000;-0,000\"","\"+0133,00;+0079,00;+0072,00;-0,000;-0,000;-0,000;-0,000\"","\"-0000,00;-0000,00;-0004,50;-0,000;-0,000;-0,814;+0,600\"","\"-0000,00;-0000,00;-0004,50;-0,000;-0,000;-0,814;+0,602\"","\"-0000,00;-0000,00;-0004,50;-0,000;-0,000;-0,814;+0,600\"","\"-0000,00;-0000,00;-0004,50;-0,000;-0,000;-0,554;-0,227\"","\"-0000,00;-0000,00;-0000,00;-0,000;-0,000;-0,000;-0,000\"","\"-0616,00;-0097,00;+0251,00;-0,000;-0,000;-0,000;-0,000\"",null,"\"-0289,00;-0734,00;-0257,00;-0,000;-0,000;-0,000;-0,000\"","\"-0000,00;-0125,00;-0194,00;-0,000;-0,000;-0,000;-0,000\"","\"+0092,00;+0093,00;-0122,00;-0,000;-0,000;-0,000;-0,000\"","\"+0087,00;+0095,00;+0120,00;-0,000;-0,000;-0,000;-0,000\"","\"-0084,00;+0022,00;-0209,00;-0,000;-0,000;-0,000;-0,000\"","\"+0346,00;+0001,00;-0224,00;-0,000;-0,000;-0,000;-0,000\"","\"+0134,00;-0229,00;+0029,00;-0,000;-0,000;-0,000;-0,000\"","\"+0057,00;-0001,00;+0041,00;-0,000;-0,000;-0,000;-0,000\"","\"+0288,00;-0175,00;+0376,00;-0,000;-0,000;-0,000;-0,000\"","\"+0057,00;-0001,00;+0041,00;-0,000;-0,000;-0,000;-0,000\"","\"+0133,00;+0077,00;+0051,00;-0,000;-0,000;-0,000;-0,000\"","\"+0088,00;+0109,00;+0122,00;-0,000;-0,000;-0,000;-0,000\"","\"-0011,00;-0072,00;+0101,00;-0,000;-0,000;-0,000;-0,000\"","\"+0249,17;+0152,09;-0391,46;-0,000;-0,000;-0,000;-0,000\"","\"+0250,20;+0153,09;-0391,70;-0,000;-0,000;-0,000;-0,000\"","\"+0128,16;+0282,42;-0021,93;-0,000;-0,000;-0,000;-0,000\"",null,"\"+0086,00;+0096,00;+0120,00;-0,000;-0,000;-0,000;-0,000\"","\"-0364,71;+0109,42;-0429,00;-0,000;-0,000;+0,156;-1,198\"",null,null,"\"+0689,00;-0691,00;+0046,00;-0,000;-0,000;-0,000;-0,000\"","\"-0001,00;-0140,00;-0165,00;-0,000;-0,000;-0,000;-0,000\"","\"+0689,00;-0691,00;+0046,00;-0,000;-0,000;-0,000;-0,000\"","\"+0128,00;+0018,00;-0224,00;-0,000;-0,000;-0,000;-0,000\"","\"+0011,00;-0851,00;-0005,00;-0,000;-0,000;-0,000;-0,000\"","\"-0008,21;-0861,39;-0001,31;-0,000;-0,000;-0,814;+0,380\"","\"-0007,00;+0010,00;+0026,00;-0,000;-0,000;-0,000;-0,000\"","\"+0043,00;+0163,00;-0045,00;-0,000;-0,000;-0,000;-0,000\"","\"+0161,00;+0014,00;-0205,00;-0,000;-0,000;-0,000;-0,000\"","\"+0097,00;-0787,00;-0086,00;-0,000;-0,000;-0,000;-0,000\"","\"+0377,00;-0681,00;+0050,00;-0,000;-0,000;-0,000;-0,000\"","\"+0265,00;-0120,00;+0358,00;-0,000;-0,000;-0,000;-0,000\"","\"+0134,00;+0105,00;+0295,00;-0,000;-0,000;-0,000;-0,000\"","\"+0158,00;+0012,00;+0299,00;-0,000;-0,000;-0,000;-0,000\"","\"+0134,00;+0048,00;-0149,00;-0,000;-0,000;-0,000;-0,000\"","\"-0214,00;-0836,00;-0303,00;-0,000;-0,000;-0,000;-0,000\"","\"+0004,69;-0008,50;-0002,89;-0,000;-0,000;-0,000;-0,000\"","\"+0263,00;-0006,00;-0431,00;-0,000;-0,000;-0,000;-0,000\"","\"+0007,00;-0152,00;-0178,00;-0,000;-0,000;-0,000;-0,000\"","\"+0022,00;-0157,00;-0180,50;-0,000;-0,000;-0,554;-0,227\"","\"+0288,00;-0175,00;+0376,00;-0,000;-0,000;-0,000;-0,000\"","\"+0057,00;-0001,00;+0041,00;-0,000;-0,000;-0,000;-0,000\"","\"-0289,00;-0734,00;-0257,00;-0,000;-0,000;-0,000;-0,000\"","\"+0169,00;+0019,00;+0278,00;-0,000;-0,000;-0,000;-0,000\"","\"+0147,00;+0074,00;+0283,00;-0,000;-0,000;-0,000;-0,000\"","\"+0142,00;+0096,00;+0293,00;-0,000;-0,000;-0,000;-0,000\""]
["Depuis","Afrique du Sud / S Africa Cape","Clarke 1880 Mod.","\"-0136,00;-0108,00;-0292,00;-0,000;-0,000;-0,000;-0,000\""]
["Depuis","Alaska / NAD27","Clarke 1866","\"-0012,62;+0156,56;+0180,52;-0,000;-0,000;+0,814;+0,427\""]
["Depuis","Alaska / NAD27","Clarke 1866","\"-0005,00;+0135,00;+0172,00;-0,000;-0,000;-0,000;-0,000\""]
["Depuis","Alaska / NAD83","GRS80","\"-0000,00;-0000,00;-0000,00;-0,000;-0,000;-0,000;-0,000\""]
["Depuis","Amerique Central / NAD83","GRS80","\"-0000,00;-0000,00;-0000,00;-0,000;-0,000;-0,000;-0,000\""]
["Depuis","Arabie Saoudite / Nahrwan","Clarke 1880 Mod.","\"-0231,00;-0196,00;+0482,00;-0,000;-0,000;-0,000;-0,000\""]
["Depuis","Argentine / Campo Inchauste","International","\"-0148,00;+0136,00;+0090,00;-0,000;-0,000;-0,000;-0,000\""]
["Depuis","Argentine / S. America 1969","S America 1969","\"-0057,00;+0001,00;-0041,00;-0,000;-0,000;-0,000;-0,000\""]
["Depuis","Australie / Australian Geodetic 1966","RE 1967","\"-0133,00;-0048,00;+0148,00;-0,000;-0,000;-0,000;-0,000\""]
["Depuis","Australie / Australian Nat","RE 1967","\"-0122,00;-0041,00;+0150,00;-0,000;-0,000;+0,554;+0,227\"",null,null,null,null,null,null,null,null,null,null,null,null,null,null,null,null,null,null,null,null,null,null,null,null,null,null,null,null,null,null,null,null,null,null,null,null,null,null,null,null,null,null,null,null,null,null,null,null,null,null,null,null,null,null,null,null,null,null,null,null,null,null,null,null,null,null,null,null,null,null,null,null,null,null,null,null,null,null,null,null,null,null,null,null,null,null,null,null,null,null,null,null,null,null,null,null,null,null,null,null,null,null,null,null,null,null,null,null,null,null,null,null,null,null,null,null,null,null,null,null,null,null,null,null,null,null,null,null,"\"-0122,00;-0041,00;+0146,00;-0,000;-0,000;-0,000;-0,000\""]
["Depuis","Australie / Autralian","RE 1984","\"-0134,00;-0048,00;+0149,00;-0,000;-0,000;-0,000;-0,000\""]
["Depuis","Bahreïn / Ain El Abl 1970","International","\"-0150,00;-0251,00;-0002,00;-0,000;-0,000;-0,000;-0,000\""]
["Depuis","Bangladesh / Indian","Everest 1830","\"+0289,00;+0734,00;+0257,00;-0,000;-0,000;-0,000;-0,000\""]
["Depuis","Belize / NAD27","Clarke 1866","\"-0000,00;+0125,00;+0194,00;-0,000;-0,000;-0,000;-0,000\""]
["Depuis","Bolivie / Prov. S America 1956","International","\"-0288,00;+0175,00;-0376,00;-0,000;-0,000;-0,000;-0,000\""]
["Depuis","Bolivie / S. America 1969","S. America 1969","\"-0057,00;+0001,00;-0041,00;-0,000;-0,000;-0,000;-0,000\""]
["Depuis","Botswana / Cape Arc 1950","Clarke 1880 Mod","\"-0138,00;-0105,00;-0289,00;-0,000;-0,000;-0,000;-0,000\""]
["Depuis","Bresil / S. America 1969","S. America 1969","\"-0057,00;+0001,00;-0041,00;-0,000;-0,000;-0,000;-0,000\""]
["Depuis","Brunei / Timbalai","Everest 1830","\"-0689,00;+0691,00;-0046,00;-0,000;-0,000;-0,000;-0,000\""]
["Depuis","Canada / NAD27","Clarke 1866","\"-0010,00;+0158,00;+0187,00;-0,000;-0,000;-0,000;-0,000\""]
[null,"Canada / NAD27 (Canada)","Clarke 1866","\"-0009,00;+0139,00;+0177,50;-0,000;-0,000;+0,554;+0,227\"",null,null,null,null,null,null,null,null,null,null,null,null,null,null,null,null,null,null,null,null,null,null,null,null,null,null,null,null,null,null,null,null,null,null,null,null,null,null,null,null,null,null,null,null,null,null,null,null,null,null,null,null,null,null,null,null,null,null,null,null,null,null,null,null,null,null,null,null,null,null,null,null,null,null,null,null,null,null,null,null,null,null,null,null,null,null,null,null,null,null,null,null,null,null,null,null,null,null,null,null,null,null,null,null,null,null,null,null,null,null,null,null,null,null,null,null,null,null,null,null,null,null,null,null,null,null,null,null,"\"-0009,00;+0139,00;+0173,00;-0,000;-0,000;-0,000;-0,000\""]
["Depuis","Canal Panama / NAD27","Clarke 1866","\"-0000,00;+0125,00;+0201,00;-0,000;-0,000;-0,000;-0,000\""]
["Depuis","Chili / Prov. S Chilean 63","International","\"+0016,00;+0196,00;+0093,00;-0,000;-0,000;-0,000;-0,000\""]
["Depuis","Chili / S. America 1969","S. America 1969","\"-0057,00;+0001,00;-0041,00;-0,000;-0,000;-0,000;-0,000\""]
[null,"Chypre / ED50","International","\"-0104,00;-0101,00;-0140,00;-0,000;-0,000;-0,000;-0,000\""]
["Depuis","Colombie / Bogota Observatory","International","\"+0307,00;+0304,00;-0318,00;-0,000;-0,000;-0,000;-0,000\""]
["Depuis","Colombie / Prov. S America 1956","International","\"-0288,00;+0175,00;-0376,00;-0,000;-0,000;-0,000;-0,000\""]
["Depuis","Colombie / S. America 1969","S. America 1969","\"-0057,00;+0001,00;-0041,00;-0,000;-0,000;-0,000;-0,000\""]
["Depuis","Corée / Tokyo","Bessel 1841","\"-0128,00;+0481,00;+0664,00;-0,000;-0,000;-0,000;-0,000\""]
[null,"Egypte / ED50","International","\"-0130,00;-0117,00;-0151,00;-0,000;-0,000;-0,000;-0,000\""]
["Depuis","Egypte / Old Egyptian","Helmert 1906","\"-0130,00;+0110,00;-0013,00;-0,000;-0,000;-0,000;-0,000\""]
["Depuis","Emirats Arabes Unifies / Nahrwan","Clarke 1880 Mod","\"-0249,00;-0156,00;+0381,00;-0,000;-0,000;-0,000;-0,000\""]
["Depuis","Equateur / Prov. S American 1956","International","\"-0288,00;+0175,00;-0376,00;-0,000;-0,000;-0,000;-0,000\""]
["Depuis","Equateur / S American 1969","S American 1969","\"-0057,00;+0001,00;-0041,00;-0,000;-0,000;-0,000;-0,000\""]
["Depuis","Erytree / Massawa","Bessel 1841","\"+0639,00;+0405,00;+0060,00;-0,000;-0,000;-0,000;-0,000\""]
[null,"Espagne / ED50","International","\"-0088,00;-0109,00;-0122,00;-0,000;-0,000;-0,000;-0,000\""]
["Depuis","Espiranto Santos / Santo (DOS)","International","\"+0170,00;+0042,00;+0084,00;-0,000;-0,000;-0,000;-0,000\""]
["Depuis","Ethiopie / Adindan","Clarke 1880 Mod","\"-0165,00;-0011,00;+0206,00;-0,000;-0,000;-0,000;-0,000\""]
["Depuis","Europe / ED50","International","\"-0089,50;-0093,80;-0123,10;-0,000;-0,000;-0,156;+1,200\"",null,null,null,null,null,null,null,null,null,null,null,null,null,null,null,null,null,null,null,null,null,null,null,null,null,null,null,null,null,null,null,null,null,null,null,null,null,null,null,"\"-0006,39;+0003,58;-0005,87;-0,006;+0,045;-0,200;+1,078\"",null,null,null,null,null,null,null,null,null,null,null,null,null,null,null,null,null,null,null,null,null,null,null,null,null,null,null,null,null,null,null,null,null,null,null,null,null,null,null,null,null,null,null,null,null,null,null,null,null,null,null,null,null,null,null,null,null,null,null,null,null,null,null,null,null,null,null,null,null,null,null,null,null,null,null,null,null,null,null,null,null,null,null,null,null,"\"-0089,50;-0093,80;-0127,60;-0,000;-0,000;-0,970;+1,800\"","\"-0083,00;-0110,00;-0118,00;-0,000;-0,000;-0,000;-0,000\"","\"-0089,50;-0093,80;-0127,60;-0,000;-0,000;-0,970;+1,800\"",null,null,null,null,null,null,null,null,null,null,null,null,null,null,null,null,null,null,null,null,null,null,null,"\"-0116,50;+0041,20;-0038,60;-0,000;-0,000;-0,710;+0,973\""]
["Depuis","Europe / ED87","International","\"-0083,11;-0097,38;-0117,23;-0,006;-0,045;+0,044;+0,122\"",null,null,null,null,null,null,null,null,null,null,null,null,null,null,null,null,null,null,null,null,null,null,null,null,null,null,null,null,null,null,null,null,null,null,null,null,null,null,"\"+0006,39;-0003,58;+0005,87;+0,006;-0,045;+0,200;-1,078\"",null,null,null,null,null,null,null,null,null,null,null,null,null,null,null,null,null,null,null,null,null,null,null,null,null,null,null,null,null,null,null,null,null,null,null,null,null,null,null,null,null,null,null,null,null,null,null,null,null,null,null,null,null,null,null,null,null,null,null,null,null,null,null,null,null,null,null,null,null,null,null,null,null,null,null,null,null,null,null,null,null,null,null,null,null,null,null,null,null,null,"\"-0082,98;-0099,72;-0110,71;-0,105;+0,031;+0,080;-0,314\""]
[null,"Finlande / ED50","International","\"-0087,00;-0095,00;-0120,00;-0,000;-0,000;-0,000;-0,000\""]
["Depuis","France / ED50 IGN","International","\"-0084,00;-0097,00;-0117,00;-0,000;-0,000;-0,000;-14,19\""]
["Depuis","France / ED79 France","International","\"-0083,00;-0095,00;-0116,00;-0,000;-0,000;-0,000;-14,19\""]
["Depuis","France / IGN/NTF","Clarke 1880 (IGN)","\"-0168,00;-0060,00;+0320,00;-0,000;-0,000;-0,000;-54,74\""]
["Depuis","France / WGS72 France","WGS72","\"+0000,00;+0012,00;+0006,00;-0,000;-0,000;-0,000;+0,031\""]
["Depuis","Gabon / M'Paraloko","Clarke 1880","\"-0077,90;-0132,90;+0043,70;-0,000;-0,000;-0,000;-0,000\""]
["Depuis","Gizo / Gizo DOS 1968","International","\"+0230,00;-0199,00;-0752,00;-0,000;-0,000;-0,000;-0,000\""]
[null,"Grece / ED50","International","\"-0084,00;-0095,00;-0130,00;-0,000;-0,000;-0,000;-0,000\""]
["Depuis","Groenland / NAD27","Clarke 1866","\"+0011,00;+0114,00;+0195,00;-0,000;-0,000;-0,000;-0,000\""]
["Depuis","Groenland / Qornoq","International","\"+0164,00;+0138,00;-0189,00;-0,000;-0,000;-0,000;-0,000\""]
["Depuis","Guatemala / NAD27","Clarke 1866","\"-0000,00;+0125,00;+0194,00;-0,000;-0,000;-0,000;-0,000\""]
["Depuis","Guyana / Prov. S American 1956","International","\"-0288,00;+0175,00;-0376,00;-0,000;-0,000;-0,000;-0,000\""]
["Depuis","Guyana / S American 1969","S American","\"-0057,00;+0001,00;-0041,00;-0,000;-0,000;-0,000;-0,000\""]
["Depuis","Honduras / NAD27","Clarke 1866","\"-0000,00;+0125,00;+0194,00;-0,000;-0,000;-0,000;-0,000\""]
["Depuis","Hong Kong / Hong Kong 1963","International","\"-0156,00;-0271,00;-0189,00;-0,000;-0,000;-0,000;-0,000\""]
["Depuis","Icelande / Hjorsey 1955","International","\"-0073,00;+0046,00;-0086,00;-0,000;-0,000;-0,000;-0,000\""]
["Depuis","Ile d'Efate et Erromango / Bellevue (IGN)","International","\"-0127,00;-0769,00;+0472,00;-0,000;-0,000;-0,000;-0,000\""]
["Depuis","Ile d'Oahu / ?","Clarke 1866","\"+0056,00;-0268,00;-0182,50;-0,000;-0,000;+0,554;+0,227\"",null,null,null,null,null,null,null,null,null,null,null,null,null,null,null,null,null,null,null,null,null,null,null,null,null,null,null,null,null,null,null,null,null,null,null,null,null,null,null,null,null,null,null,null,null,null,null,null,null,null,null,null,null,null,null,null,null,null,null,null,null,null,null,null,null,null,null,null,null,null,null,null,null,null,null,null,null,null,null,null,null,null,null,null,null,null,null,null,null,null,null,null,null,null,null,null,null,null,null,null,null,null,null,null,null,null,null,null,null,null,null,null,null,null,null,null,null,null,null,null,null,null,null,null,null,null,null,null,"\"+0056,00;-0268,00;-0187,00;-0,000;-0,000;-0,000;-0,000\""]
["Depuis","Ile de Costa Rica / NAD27","Clarke 1866","\"-0000,00;+0125,00;+0194,00;-0,000;-0,000;-0,000;-0,000\""]
["Depuis","Ile de Cuba / NAD27","Clarke 1866","\"-0007,00;+0152,00;+0178,00;-0,000;-0,000;-0,000;-0,000\""]
["Depuis","Ile de Guam / Guam 1963","Clarke 1966","\"+0252,00;-0209,00;-0751,00;-0,000;-0,000;-0,000;-0,000\""]
["Depuis","Ile de Kerguelen / Kerguelen","International","\"+0145,00;-0187,00;+0103,00;-0,000;-0,000;-0,000;-0,000\""]
["Depuis","Ile de l'Ascension / Ascension 1958","International","\"-0207,00;+0107,00;+0052,00;-0,000;-0,000;-0,000;-0,000\""]
["Depuis","Ile de la Barbades / NAD27","Clarke 1866","\"-0007,00;+0152,00;+0178,00;-0,000;-0,000;-0,000;-0,000\""]
["Depuis","Ile de la Jamaique / NAD27","Clarke 1866","\"-0007,00;+0152,00;+0178,00;-0,000;-0,000;-0,000;-0,000\""]
["Depuis","Ile de Madere / SE Base","International","\"-0499,00;-0249,00;+0314,00;-0,000;-0,000;-0,000;-0,000\""]
["Depuis","Ile de Sao Miguel / Sao Braz","International","\"-0203,00;+0141,00;+0053,00;-0,000;-0,000;-0,000;-0,000\""]
[null,"Ile de Sardaigne / ED50","International","\"-0097,00;-0103,00;-0120,00;-0,000;-0,000;-0,000;-0,000\""]
["Depuis","Ile de Sardaigne / Rome 1940","International","\"-0255,00;-0065,00;+0009,00;-0,000;-0,000;-0,000;-0,000\""]
[null,"Ile de Sicile / ED50","International","\"-0097,00;-0088,00;-0135,00;-0,000;-0,000;-0,000;-0,000\""]
["Depuis","Ile de Tern / Asrto B4","International","\"+0114,00;-0116,00;-0333,00;-0,000;-0,000;-0,000;-0,000\""]
["Depuis","Ile Diego Garcia / ISTS 073 Astro 1969","International","\"+0208,00;-0435,00;-0229,00;-0,000;-0,000;-0,000;-0,000\""]
["Depuis","Ile Dominique / NAD27","Clarke 1866","\"-0007,00;+0152,00;+0178,00;-0,000;-0,000;-0,000;-0,000\""]
["Depuis","Ile Georgia / DOS 1968","International","\"+0230,00;-0199,00;-0752,00;-0,000;-0,000;-0,000;-0,000\""]
["Depuis","Ile Grand Cayman / NAD27","Clarke 1866","\"-0007,00;+0152,00;+0178,00;-0,000;-0,000;-0,000;-0,000\""]
["Depuis","Ile Guadalcanal / Gux 1 Astro","International","\"+0252,00;-0209,00;-0751,00;-0,000;-0,000;-0,000;-0,000\""]
["Depuis","Ile Hawaii Hawaii / Old Hawaiian","Clarke 1866","\"+0089,00;-0279,00;-0183,00;-0,000;-0,000;-0,000;-0,000\""]
["Depuis","Ile Hawaii Kauai / Old Hawaiian","Clarke 1866","\"+0045,00;-0290,00;-0172,00;-0,000;-0,000;-0,000;-0,000\"",null,null,null,null,null,null,null,null,null,null,null,null,null,null,null,null,null,null,null,null,null,null,null,null,null,null,null,null,null,null,null,null,null,null,null,null,null,null,null,null,null,null,null,null,null,null,null,null,null,null,null,null,null,null,null,null,null,null,null,null,null,null,null,null,null,null,null,null,null,null,null,null,null,null,null,null,null,null,null,null,null,null,null,null,null,null,null,null,null,null,null,null,null,null,null,null,null,null,null,null,null,null,null,null,null,null,null,null,null,null,null,null,null,null,null,null,null,null,null,null,null,null,null,null,null,null,null,null,"\"+0271,00;-0046,00;-0181,0;-0,000;-0,000;-0,000;-0,000\""]
["Depuis","Ile Hawaii Maui / Old Hawaiian","Clarke 1866","\"+0065,00;-0290,00;-0190,00;-0,000;-0,000;-0,000;-0,000\"",null,null,null,null,null,null,null,null,null,null,null,null,null,null,null,null,null,null,null,null,null,null,null,null,null,null,null,null,null,null,null,null,null,null,null,null,null,null,null,null,null,null,null,null,null,null,null,null,null,null,null,null,null,null,null,null,null,null,null,null,null,null,null,null,null,null,null,null,null,null,null,null,null,null,null,null,null,null,null,null,null,null,null,null,null,null,null,null,null,null,null,null,null,null,null,null,null,null,null,null,null,null,null,null,null,null,null,null,null,null,null,null,null,null,null,null,null,null,null,null,null,null,null,null,null,null,null,null,"\"+0272,00;-0065,00;+0197,00;-0,000;-0,000;-0,000;-0,000\""]
["Depuis","Ile Hawaii Oahu / Old Hawaiian","Clarke 1866","\"+0056,00;-0284,00;-0181,00;-0,000;-0,000;-0,000;-0,000\"",null,null,null,null,null,null,null,null,null,null,null,null,null,null,null,null,null,null,null,null,null,null,null,null,null,null,null,null,null,null,null,null,null,null,null,null,null,null,null,null,null,null,null,null,null,null,null,null,null,null,null,null,null,null,null,null,null,null,null,null,null,null,null,null,null,null,null,null,null,null,null,null,null,null,null,null,null,null,null,null,null,null,null,null,null,null,null,null,null,null,null,null,null,null,null,null,null,null,null,null,null,null,null,null,null,null,null,null,null,null,null,null,null,null,null,null,null,null,null,null,null,null,null,null,null,null,null,null,"\"+0268,00;-0056,00;+0187,00;-0,000;-0,000;-0,000;-0,000\""]
["Depuis","Ile Iwo Jima / Astro Beacon East","International","\"+0145,00;+0075,00;-0272,00;-0,000;-0,000;-0,000;-0,000\""]
["Depuis","Ile Johnson / Johnson Is 1961","International","\"+0191,00;-0077,00;-0204,00;-0,000;-0,000;-0,000;-0,000\""]
["Depuis","Ile Mahe / Ile Mahe 1971","Clarke 1880 Mod","\"+0041,00;-0220,00;-0134,00;-0,000;-0,000;-0,000;-0,000\""]
["Depuis","Ile Marcus / Asrto Stn 1952","International","\"+0124,00;-0234,00;-0025,00;-0,000;-0,000;-0,000;-0,000\""]
["Depuis","Ile Pitcairn / Pitcairn Astro 1967","International","\"+0185,00;+0165,00;+0042,00;-0,000;-0,000;-0,000;-0,000\""]
[null,"Ile Saint Helene / Astro DOS 7","International","\"-0320,00;+0550,00;-0494,00;-0,000;-0,000;-0,000;-0,000\""]
["Depuis","Ile Santa Maria / Sao Braz","International","\"-0203,00;+0141,00;+0053,00;-0,000;-0,000;-0,000;-0,000\""]
["Depuis","Ile Tristan da Cunha / Tristan Astro","International","\"-0632,00;+0438,00;-0609,00;-0,000;-0,000;-0,000;-0,000\""]
["Depuis","Ile Viti Levu / Viti Levu 1916","Clarke 1880 Mod","\"+0051,00;+0391,00;-0036,00;-0,000;-0,000;-0,000;-0,000\""]
["Depuis","Iles Bahamas / Cape Canaveral","Clarke 1866","\"-0002,00;+0150,00;+0181,00;-0,000;-0,000;-0,000;-0,000\""]
["Depuis","Iles Bahamas / NAD27","Clarke 1866","\"-0004,00;+0154,00;+0178,00;-0,000;-0,000;-0,000;-0,000\""]
["Depuis","Iles Caicos / NAD27","Clarke 1866","\"-0007,00;+0152,00;+0178,00;-0,000;-0,000;-0,000;-0,000\""]
["Depuis","Iles Caiman / LC 5 Astro","Clarke 1866","\"+0042,00;+0124,00;+0147,00;-0,000;-0,000;-0,000;-0,000\""]
["Depuis","Iles Canaries / Pico de las Nieves","International","\"-0307,00;-0092,00;+0127,00;-0,000;-0,000;-0,000;-0,000\""]
["Depuis","Iles Chatam / Ile Chatam 1971","International","\"+0175,00;-0038,00;+0113,00;-0,000;-0,000;-0,000;-0,000\""]
["Depuis","Iles Cocos / Australian","RE 1967","\"-0491,00;-0022,00;+0435,00;-0,000;-0,000;-0,000;-0,000\""]
["Depuis","Iles de Mascarenes / Reunion","International","\"+0094,00;-0948,00;-1262,00;-0,000;-0,000;-0,000;-0,000\""]
["Depuis","Iles de Midway / Midway Astro 1961","International","\"+0912,00;-0058,00;+1227,00;-0,000;-0,000;-0,000;-0,000\""]
["Depuis","Iles de Paques / Iles de Paques 1967","International","\"+0211,00;+0147,00;+0111,00;-0,000;-0,000;-0,000;-0,000\""]
["Depuis","Iles des Açores / Observatorio 1966","International","\"-0425,00;-0169,00;+0081,00;-0,000;-0,000;-0,000;-0,000\""]
["Depuis","Iles des Açores / SW Base","International","\"-0104,00;+0167,00;-0038,00;-0,000;-0,000;-0,000;-0,000\""]
["Depuis","Iles des Bermudes / Bermuda 1957","Clarke 1866","\"-0073,00;+0213,00;+0296,00;-0,000;-0,000;-0,000;-0,000\""]
["Depuis","Iles Falklands / Sapper Hill 1943","International","\"-0355,00;+0016,00;+0074,00;-0,000;-0,000;-0,000;-0,000\""]
["Depuis","Iles Maldives / Gandajika Base","International","\"-0133,00;-0321,00;+0050,00;-0,000;-0,000;-0,000;-0,000\""]
["Depuis","Iles Marshall / Wake Eniwetok 1960","Hough","\"+0101,00;+0052,00;-0039,00;-0,000;-0,000;-0,000;-0,000\""]
["Depuis","Iles Phoenix / Canton Astro 1966","International","\"+0298,00;-0304,00;-0375,00;-0,000;-0,000;-0,000;-0,000\""]
["Depuis","Iles Salvages / Marco Astro","International","\"-0289,00;-0124,00;+0060,00;-0,000;-0,000;-0,000;-0,000\""]
["Depuis","Iles Sous le Vent / NAD27","Clarke 1866","\"-0007,00;+0152,00;+0178,00;-0,000;-0,000;-0,000;-0,000\""]
["Depuis","Iles Trinité & Tobago / Naparima (BWI)","International","\"-0002,00;+0374,00;+0172,00;-0,000;-0,000;-0,000;-0,000\""]
["Depuis","Iles Trinité & Tobago / S. American 1969","S. American 1969","\"-0057,00;+0001,00;-0041,00;-0,000;-0,000;-0,000;-0,000\""]
["Depuis","Iles Vierges / Puerto Rico","Clarke 1866","\"+0011,00;+0072,00;-0101,00;-0,000;-0,000;-0,000;-0,000\""]
[null,"Iran / ED50","International","\"-0117,00;-0132,00;-0164,00;-0,000;-0,000;-0,000;-0,000\""]
["Depuis","Irelande / Ireland 1965","Airy Mod","\"+0506,00;-0122,00;+0611,00;-0,000;-0,000;-0,000;-0,000\""]
["Depuis","Japon / Tokyo","Bessel 1841","\"-0128,00;+0481,00;+0664,00;-0,000;-0,000;-0,000;-0,000\""]
["Depuis","Kenya / Cape Arc 1960","Clarke 1880 Mod","\"-0161,00;-0007,00;-0300,00;-0,000;-0,000;-0,000;-0,000\""]
["Depuis","Lesotho / Cape Arc 1950","Clarke 1880 Mod","\"-0125,00;-0108,00;-0295,00;-0,000;-0,000;-0,000;-0,000\""]
["Depuis","Liberia / Liberia 1964","Clarke 1880 Mod","\"-0090,00;+0040,00;+0088,00;-0,000;-0,000;-0,000;-0,000\""]
["Depuis","Malaisie (Est) / Timbalia","Everest 1830","\"-0689,00;+0691,00;-0046,00;-0,000;-0,000;-0,000;-0,000\""]
["Depuis","Malaisie (Ouest) / Kertau 1948","Everest Mod","\"-0011,00;+0851,00;+0005,00;-0,000;-0,000;-0,000;-0,000\""]
["Depuis","Malawi / Cape Arc 1950","Clarke 1880 Mod","\"-0161,00;-0073,00;-0317,00;-0,000;-0,000;-0,000;-0,000\""]
["Depuis","Mali / Adindan","Clarke 1880 Mod","\"-0163,00;-0020,00;+0220,00;-0,000;-0,000;-0,000;-0,000\""]
["Depuis","Maroc / Merchich","Clarke 1880 Mod","\"+0031,00;+0146,00;+0047,00;-0,000;-0,000;-0,000;-0,000\""]
["Depuis","Maui / Maui","Clarke 1866","\"+0065,00;-0272,00;-0192,50;-0,000;-0,000;+0,554;+0,227\"",null,null,null,null,null,null,null,null,null,null,null,null,null,null,null,null,null,null,null,null,null,null,null,null,null,null,null,null,null,null,null,null,null,null,null,null,null,null,null,null,null,null,null,null,null,null,null,null,null,null,null,null,null,null,null,null,null,null,null,null,null,null,null,null,null,null,null,null,null,null,null,null,null,null,null,null,null,null,null,null,null,null,null,null,null,null,null,null,null,null,null,null,null,null,null,null,null,null,null,null,null,null,null,null,null,null,null,null,null,null,null,null,null,null,null,null,null,null,null,null,null,null,null,null,null,null,null,null,"\"+0065,00;-0272,00;-0197,00;-0,000;-0,000;-0,000;-0,000\""]
["Depuis","Mexique / NAD27","Clarke 1866","\"-0012,00;+0130,00;+0190,00;-0,000;-0,000;-0,000;-0,000\""]
["Depuis","Mindanao / Luzon","Clarke 1866","\"-0133,00;-0079,00;-0072,00;-0,000;-0,000;-0,000;-0,000\""]
["Depuis","Monde / DOPPLER","Precise","\"-0000,00;-0000,00;+0004,50;-0,000;-0,000;+0,814;-0,600\"",null,null,null,null,null,null,null,null,null,null,null,null,null,null,null,null,null,null,null,null,null,null,null,null,null,null,null,null,null,null,null,null,null,null,null,null,null,null,null,null,null,null,null,null,null,null,null,null,null,null,null,null,null,null,null,null,null,null,null,null,null,null,null,null,null,null,null,null,null,null,null,null,null,null,null,null,null,null,null,null,null,null,null,null,null,null,null,null,null,null,null,null,null,null,null,null,null,null,null,null,null,null,null,null,null,null,null,null,null,null,null,null,null,null,null,null,null,null,null,null,null,null,null,null,null,null,null,"\"-0000,00;-0000,00;-0000,00;-0,000;-0,000;-0,260;+0,827\"","\"-0000,00;-0000,00;-0000,00;-0,000;-0,000;+0,260;-0,827\"","\"-0000,00;-0000,00;+0004,50;-0,000;-0,000;+0,814;-6,000\""]
["Depuis","Monde / NWL10D","Broadcast","\"-0000,00;-0000,00;+0004,50;-0,000;-0,000;+0,814;-0,602\""]
["Depuis","Monde / NWL9D","Precise","\"-0000,00;-0000,00;+0004,50;-0,000;-0,000;+0,814;-0,600\""]
["Depuis","Monde / WGS72","WGS72","\"-0000,00;-0000,00;+0004,50;-0,000;-0,000;+0,554;+0,227\""]
[null,"Monde / WGS84 SEA","WGS84","\"-0000,00;-0000,00;+0000,00;-0,000;-0,000;+0,000;-0,000\""]
["Depuis","Namibie / Schwarzeck","Bessel 1841 Mod","\"+0616,00;+0097,00;-0251,00;-0,000;-0,000;-0,000;-0,000\""]
["Depuis","Neherlandes / RD","Bessel RD",null,null,null,null,null,null,null,null,null,null,null,null,null,null,null,null,null,null,null,null,null,null,null,null,null,null,null,null,null,null,null,null,null,null,null,null,null,null,null,"\"+0676,52;+0121,57;+0595,27;-0,000;-0,000;-0,000;-0,000\""]
["Depuis","Nepal / Indian","Everst 1830","\"+0289,00;+0734,00;+0257,00;-0,000;-0,000;-0,000;-0,000\""]
["Depuis","Nicaragua / NAD27","Clarke 1866","\"-0000,00;+0125,00;+0194,00;-0,000;-0,000;-0,000;-0,000\""]
["Depuis","Nigeria / Minna","Clarke 1880 Mod","\"-0092,00;-0093,00;+0122,00;-0,000;-0,000;-0,000;-0,000\""]
[null,"Norvège / ED50","International","\"-0087,00;-0095,00;-0120,00;-0,000;-0,000;-0,000;-0,000\""]
["Depuis","Nouvelles Zelandes / GD 1949","International","\"+0084,00;-0022,00;+0209,00;-0,000;-0,000;-0,000;-0,000\""]
["Depuis","Oman / Oman","Clarke 1880 Mod","\"-0346,00;-0001,00;+0224,00;-0,000;-0,000;-0,000;-0,000\""]
["Depuis","Paraguay / Chua Astro","International","\"-0134,00;+0229,00;-0029,00;-0,000;-0,000;-0,000;-0,000\""]
["Depuis","Paraguay / S American 1969","S American 1969","\"-0057,00;+0001,00;-0041,00;-0,000;-0,000;-0,000;-0,000\""]
["Depuis","Perou / Prov S American 1956","International","\"-0288,00;+0175,00;-0376,00;-0,000;-0,000;-0,000;-0,000\""]
["Depuis","Perou / S American 1969","S American 1969","\"-0057,00;+0001,00;-0041,00;-0,000;-0,000;-0,000;-0,000\""]
["Depuis","Phillipines / Luzon 1911","Clarke 1866","\"-0133,00;-0077,00;-0051,00;-0,000;-0,000;-0,000;-0,000\""]
[null,"Portugal / ED50","International","\"-0088,00;-0109,00;-0122,00;-0,000;-0,000;-0,000;-0,000\""]
["Depuis","Puerto Rico / Puerto Rico","Clarke 1866","\"+0011,00;+0072,00;-0101,00;-0,000;-0,000;-0,000;-0,000\""]
["Depuis","Qatar / Nahrwan","Clarke 1880 Mod","\"-0249,17;-0152,09;+0391,46;-0,000;-0,000;-0,000;+0,000\""]
[null,"Qatar / Nahrwan Maersk","Clarke 1880 Mod","\"-0250,20;-0153,09;+0391,70;-0,000;-0,000;-0,000;+0,000\""]
["Depuis","Qatar / Qatar National","International","\"-0128,16;-0282,42;+0021,93;-0,000;-0,000;-0,000;-0,000\""]
["Depuis","Royaume Uni / DOPPLER","Precise",null,null,null,null,null,null,null,null,null,null,null,null,null,null,null,null,null,null,null,null,null,null,null,null,null,null,null,null,null,null,null,null,null,null,null,null,null,null,null,null,null,null,null,null,null,null,null,null,null,null,null,null,null,null,null,null,null,null,null,null,null,null,null,null,null,null,null,null,null,null,null,null,null,null,null,null,null,null,null,null,null,null,null,null,null,null,null,null,null,null,null,null,null,null,null,null,null,null,null,null,null,null,null,null,null,null,null,null,null,null,null,null,null,null,null,null,null,null,null,null,null,null,null,null,null,null,null,null,null,null,null,null,null,null,null,null,null,null,null,null,null,null,null,null,null,null,null,null,null,null,null,"\"-0370,30;+0111,06;-0431,17;-0,000;-0,000;+0,800;-0,400\""]
["Depuis","Royaume Uni / ED50","International","\"-0086,00;-0096,00;-0120,00;-0,000;-0,000;-0,000;-0,000\"",null,null,null,null,null,null,null,null,null,null,null,null,null,null,null,null,null,null,null,null,null,null,null,null,null,null,null,null,null,null,null,null,null,null,null,null,null,null,null,null,null,null,null,null,null,null,null,null,null,null,null,null,null,null,null,null,null,null,null,null,null,null,null,null,null,null,null,null,null,null,null,null,null,null,null,null,null,null,null,null,null,null,null,null,null,null,null,null,null,null,null,null,null,null,null,null,null,null,null,null,null,null,null,null,null,null,null,null,null,null,null,null,null,null,null,null,null,null,null,null,null,null,null,null,null,null,null,null,null,null,null,null,null,null,null,null,null,null,null,null,null,null,null,null,null,null,null,null,null,null,"\"-0459,80;+0017,26;-0558,77;-0,000;-0,000;-0,170;+1,400\""]
["Depuis","Royaume Uni / OS(SN)80","Airy","\"+0364,71;-0109,42;+0429,00;-0,000;-0,000;-0,156;+1,198\"",null,null,null,null,null,null,null,null,null,null,null,null,null,null,null,null,null,null,null,null,null,null,null,null,null,null,null,null,null,null,null,null,null,null,null,null,null,null,null,null,null,null,null,null,null,null,null,null,null,null,null,null,null,null,null,null,null,null,null,null,null,null,null,null,null,null,null,null,null,null,null,null,null,null,null,null,null,null,null,null,null,null,null,null,null,null,null,null,null,null,null,null,null,null,null,null,null,null,null,null,null,null,null,null,null,null,null,null,null,null,null,null,null,null,null,null,null,null,null,null,null,null,null,null,null,null,null,null,null,null,null,null,null,null,null,null,null,null,null,null,null,null,null,null,null,null,null,null,null,"\"+0454,21;-0015,62;+0552,10;-0,000;-0,000;-0,000;-0,000\""]
["Depuis","Russie / Pulkovo","Krassovsky",null,null,null,null,null,null,null,null,null,null,null,null,null,null,null,null,null,null,null,null,null,null,null,null,null,null,null,null,null,null,null,null,null,null,null,null,null,null,null,"\"+0116,00;-0041,20;+0038,60;-0,000;-0,000;+0,710;-0,973\""]
["Depuis","Russie / WGS72","WGS72",null,null,null,null,null,null,null,null,null,null,null,null,null,null,null,null,null,null,null,null,null,null,null,null,null,null,null,null,null,null,null,null,null,null,null,null,null,null,null,null,null,null,null,null,null,null,null,null,null,null,null,null,null,null,null,null,null,null,null,null,null,null,null,null,null,null,null,null,null,null,null,null,null,null,null,null,null,null,null,null,null,null,null,null,null,null,null,null,null,null,null,null,null,null,null,null,null,null,null,null,null,null,null,null,null,null,null,null,null,null,null,null,null,null,null,null,null,null,null,null,null,null,null,null,null,null,null,null,null,null,null,null,null,null,null,null,null,null,null,null,null,null,null,null,null,null,null,null,null,null,null,null,"\"-0027,00;+0135,00;+0089,00;-0,000;-0,000;-0,000;-0,000\""]
["Depuis","Sabah / Timbalai 1948","Everest 1830","\"-0689,00;+0691,00;-0046,00;-0,000;-0,000;-0,000;-0,000\""]
["Depuis","San Salvador / NAD27","Clarke 1866","\"+0001,00;+0140,00;+0165,00;-0,000;-0,000;-0,000;-0,000\""]
["Depuis","Sarawak / Timbalai 1948","Everst 1830","\"-0689,00;+0691,00;-0046,00;-0,000;-0,000;-0,000;-0,000\""]
["Depuis","Senegal / Adindan","Clarke 1880 Mod","\"-0128,00;-0018,00;+0224,00;-0,000;-0,000;-0,000;-0,000\""]
["Depuis","Singapour / Kertau 1948","Everest Mod","\"-0011,00;+0851,00;+0005,00;-0,000;-0,000;-0,000;-0,000\""]
["Depuis","Singapour / Kertau 1948","Everest 1830","\"+0008,21;+0861,39;+0001,31;-0,000;-0,000;+0,814;-0,380\""]
["Depuis","Singapour / South Asia","Fisher Mod","\"+0007,00;-0010,00;-0026,00;-0,000;-0,000;-0,000;-0,000\""]
["Depuis","Somalie / Afgooye","Krassovsky","\"-0043,00;-0163,00;+0045,00;-0,000;-0,000;-0,000;-0,000\""]
["Depuis","Soudan / Adindan","Clarke 1880 Mod","\"-0161,00;-0014,00;+0205,00;-0,000;-0,000;-0,000;-0,000\""]
["Depuis","Sri Lanka / Kandawala","Everest 1830","\"-0097,00;+0787,00;+0086,00;-0,000;-0,000;-0,000;-0,000\""]
["Depuis","Sumatra / Djakarta (Batavia)","Bessel 1841","\"-0377,00;+0681,00;-0050,00;-0,000;-0,000;-0,000;-0,000\""]
["Depuis","Surinam / Zanderij","International","\"-0265,00;+0120,00;-0358,00;-0,000;-0,000;-0,000;-0,000\""]
[null,"Swaziland / Cape Arc 1950","Clarke 1880","\"-0134,00;-0105,00;-0295,00;-0,000;-0,000;-0,000;-0,000\""]
["Depuis","Tanzanie / Cape Arc 1960","Clarke 1880","\"-0158,00;-0012,00;-0299,00;-0,000;-0,000;-0,000;-0,000\""]
["Depuis","Tasmanie / Australian National","RE 1967","\"-0134,00;-0048,00;+0149,00;-0,000;-0,000;-0,000;-0,000\""]
["Depuis","Thailande / Indian","Everest 1830","\"+0214,00;+0836,00;+0303,00;-0,000;-0,000;-0,000;-0,000\""]
["Depuis","Thailande / Moattama","WGS84","\"-0004,69;+0008,50;+0002,89;-0,000;-0,000;-0,000;-0,000\""]
["Depuis","Tunisie / Carthage","Clarke 1880 Mod","\"-0263,00;+0006,00;+0431,00;-0,000;-0,000;-0,000;-0,000\""]
["Depuis","Turquie / NAD27","Clarke 1866","\"-0007,00;+0152,00;+0178,00;-0,000;-0,000;-0,000;-0,000\""]
["Depuis","USA / NAD27 (CONUS)","Clarke 1866","\"-0022,00;+0157,00;+0180,50;-0,000;-0,000;+0,554;+0,227\"",null,null,null,null,null,null,null,null,null,null,null,null,null,null,null,null,null,null,null,null,null,null,null,null,null,null,null,null,null,null,null,null,null,null,null,null,null,null,null,null,null,null,null,null,null,null,null,null,null,null,null,null,null,null,null,null,null,null,null,null,null,null,null,null,null,null,null,null,null,null,null,null,null,null,null,null,null,null,null,null,null,null,null,null,null,null,null,null,null,null,null,null,null,null,null,null,null,null,null,null,null,null,null,null,null,null,null,null,null,null,null,null,null,null,null,null,null,null,null,null,null,null,null,null,null,null,null,null,"\"-0022,00;+0157,00;+0176,00;-0,000;-0,000;-0,000;-0,000\""]
["Depuis","Venezuela / Prov. S. American 1956","International","\"-0288,00;+0175,00;-0376,00;-0,000;-0,000;-0,000;-0,000\""]
["Depuis","Venezuela / S. American 1969","S. American 1969","\"-0057,00;+0001,00;-0041,00;-0,000;-0,000;-0,000;-0,000\""]
["Depuis","Vietnam / Indian","Everest 1830","\"+0289,00;+0734,00;+0257,00;-0,000;-0,000;-0,000;-0,000\""]
["Depuis","Zaire / Cape Arc 1950","Clarke 1880","\"-0169,00;-0019,00;-0278,00;-0,000;-0,000;-0,000;-0,000\""]
["Depuis","Zambie / Cape Arc 1950","Clarke 1880","\"-0147,00;-0074,00;-0283,00;-0,000;-0,000;-0,000;-0,000\""]
["Depuis","Zimbabwe / Cape Arc 1950","Clarke 1880","\"-0142,00;-0096,00;-0293,00;-0,000;-0,000;-0,000;-0,000\""]
["Depuis"," / "]
["Depuis"," / "]
["Depuis"," / "]
["Depuis"," / "]
["Depuis"," / "]
["Depuis"," / "]
["Depuis"," / "]
["Depuis"," / "]
["Depuis"," / "]