{"text_format":"1","workbook":"xlsx","n_sheets":6,"sheets":["Geodesie","Modele","Projections","Couper_Inserer","Spheroides","Table Datum Shifts"],"not_rendered":{"charts":0,"images":0,"macros":1,"external_links":0,"defined_names":2,"comments":0,"pivot_tables":0},"unopened":[{"sheet":"Couper_Inserer","index":3,"reason":"part_missing"}],"bounds":{"document_bytes":16777216,"sheet_cells":100000,"rows_first":2000,"rows_last":500,"rows_between":2000,"halvings":0,"cell_chars":16384,"cell_head_chars":4096},"cells_cut":0,"cells_raw":0,"read":"whole","date_system":"1900"}

{"sheet":"Geodesie","index":0,"n_rows":26,"n_cols":15,"rows_kept":26,"cut":false,"hidden":false,"merged":[]}
["Paramètres de Base des Géodésique Utilisées",null,"Définition des Paramètres géodésiques"]
[]
["Index",null,null,"Système 1",null,null,null,null,"Index",null,null,"Système 2"]
["Datum:",1,null,"Région & Datum:",{"$f":"(INDEX('Table Datum Shifts'!B15:B203,B4))","v":"Monde / WGS84"},null,null,null,"Datum:",45,null,"Région & Datum:",{"$f":"(INDEX('Table Datum Shifts'!B15:B203,J4))","v":"France / IGN/NTF"},"Projection",{"$f":"INDEX(Projections!C8:C17,J6)","v":"Lambert 1"}]
["Spheroide:",42,null,"Ellipsoïde:",{"$f":"INDEX(Spheroides!C8:C56,B5)","v":"WGS 84"},null,null,null,"Sphéroïde:",42,null,"Ellipsoïde",{"$f":"INDEX(Spheroides!C8:C56,J5)","v":"WGS 84"},"Merid. Ctrl.",{"$f":"INDEX(Projections!E8:E17,J6)","v":2.3372291666666669}]
[null,null,null,"Gd Axe:",{"$f":"INDEX(Spheroides!D8:D56,B5)","v":6378137},null,null,null,"Projection:",1,null,"Gd Axe",{"$f":"INDEX(Spheroides!D8:D56,J5)","v":6378137},"E/W",{"$f":"INDEX(Projections!F8:F17,J6)","v":"E"}]
[null,null,null,"Pt Axe:",{"$f":"INDEX(Spheroides!E8:E56,B5)","v":6356752.3140000002},null,null,null,null,null,null,"Pt Axe",{"$f":"INDEX(Spheroides!E8:E56,J5)","v":6356752.3140000002},"Lat. Or.",{"$f":"INDEX(Projections!G8:G17,J6)","v":49.5}]
[null,null,null,"e2",{"$f":"INDEX(Spheroides!F8:F56,B5)","v":6.6943800667646578E-3},null,null,null,null,null,null,"e2",{"$f":"INDEX(Spheroides!F8:F56,J5)","v":6.6943800667646578E-3},"N/S",{"$f":"INDEX(Projections!H8:H17,J6)","v":"N"}]
[null,null,null,"n",{"$f":"INDEX(Spheroides!G8:G56,B5)","v":1.6792204056685965E-3},null,null,null,null,null,null,"n",{"$f":"INDEX(Spheroides!G8:G56,J5)","v":1.6792204056685965E-3},"Aplat.",{"$f":"INDEX(Projections!I8:I17,J6)","v":0.99987734100000003}]
[null,null,null,"1 / f",{"$f":"INDEX(Spheroides!H8:H56,B5)","v":298.25722014342756},null,null,null,null,null,null,"1 / f",{"$f":"INDEX(Spheroides!H8:H56,J5)","v":298.25722014342756},"Faux E",{"$f":"INDEX(Projections!J8:J17,J6)","v":600000}]
{"$rows_left_out":17}
{"sheet":"Modele","index":1,"n_rows":49,"n_cols":26,"rows_kept":49,"cut":false,"hidden":false,"merged":[]}
["Version du 09/11/97","Position",{"$f":"Geodesie!E4","v":"Monde / WGS84"},null,null,null,null,null,null,"Geographical",null,null,{"$f":"Geodesie!M4","v":"France / IGN/NTF"},null,null,null,null,"Slack","Cable Distance",null,"Cable","Cumulative","Totals","Approx"]
["Christian Auroux","Number",null,null,null,null,null,null,"Heading","Length","Cumul.",null,{"$f":"Geodesie!O4","v":"Lambert 1"},null,null,null,null,"%","Length","Cumul.","Type","by type","By Type","Depth",null,"Comments"]
["geolambshift",null,"Latitude",null,null,"Longitude",null,null,null,"(km)","(km)",null,"Eastings","Northings",null,null,null,null,"(km)","(km)",null,null,"(km)","(m)"]
[]
[null,1,43,7.5092526583775099,{"$f":"IF(OR(C5<0,AND(C5=0,D5<0)),\"S\",\"N\")","v":"N"},1,27.413352850369701,{"$f":"IF(OR(F5<0,AND(F5=0,G5<0)),\"W\",\"E\")","v":"E"},null,null,0,null,{"$f":"GeoLambShiftX(C5,D5,F5,G5)","v":527997.97248730471},{"$f":"GeoLambShiftY(C5,D5,F5,G5)","v":490126.5879863007},null,0,null,null,null,0,null,0,{"$f":"IF(U4=U6,\"\",V5)","v":""}]
[null,null,null,null,null,null,null,null,{"$f":"Cap(C5,D5,F5,G5,C7,D7,F7,G7)","v":44.167282270744778},{"$f":"Distance(C5,D5,F5,G5,C7,D7,F7,G7)","v":2.8728331287599116},null,null,null,null,null,null,null,null,{"$f":"J6*(1+R6/100)","v":2.8728331287599116}]
[null,{"$f":"B5+1","v":2},43,8.6221927378817043,{"$f":"IF(OR(C7<0,AND(C7=0,D7<0)),\"S\",\"N\")","v":"N"},1,28.889456977704,{"$f":"IF(OR(F7<0,AND(F7=0,G7<0)),\"W\",\"E\")","v":"E"},null,null,{"$f":"K5+J6","v":2.8728331287599116},null,{"$f":"GeoLambShiftX(C7,D7,F7,G7)","v":530035.06348819216},{"$f":"GeoLambShiftY(C7,D7,F7,G7)","v":492175.98865935951},null,null,null,null,null,{"$f":"T5+S6","v":2.8728331287599116},null,{"$f":"IF(U6=U4,V5+S6,S6)","v":2.8728331287599116},{"$f":"IF(U6=U8,\"\",V7)","v":""}]
[null,null,null,null,null,null,null,null,{"$f":"Cap(C7,D7,F7,G7,C9,D9,F9,G9)","v":30.030280251917389},{"$f":"Distance(C7,D7,F7,G7,C9,D9,F9,G9)","v":5.8772496578676803},null,null,null,null,null,null,null,null,{"$f":"J8*(1+R8/100)","v":5.8772496578676803}]
[null,{"$f":"B7+1","v":3},43,11.370245538609538,{"$f":"IF(OR(C9<0,AND(C9=0,D9<0)),\"S\",\"N\")","v":"N"},1,31.059635174427999,{"$f":"IF(OR(F9<0,AND(F9=0,G9<0)),\"W\",\"E\")","v":"E"},null,null,{"$f":"K7+J8","v":8.7500827866275923},null,{"$f":"GeoLambShiftX(C9,D9,F9,G9)","v":533050.08091572532},{"$f":"GeoLambShiftY(C9,D9,F9,G9)","v":497260.46712170914},null,null,null,null,null,{"$f":"T7+S8","v":8.7500827866275923},null,{"$f":"IF(U8=U6,V7+S8,S8)","v":8.7500827866275923},{"$f":"IF(U8=U10,\"\",V9)","v":""}]
[null,null,null,null,null,null,null,null,{"$f":"Cap(C9,D9,F9,G9,C11,D11,F11,G11)","v":53.670708949897772},{"$f":"Distance(C9,D9,F9,G9,C11,D11,F11,G11)","v":8.7894950357563744},null,null,null,null,null,null,null,null,{"$f":"J10*(1+R10/100)","v":8.7894950357563744}]
{"$rows_left_out":40}
{"sheet":"Projections","index":2,"n_rows":39,"n_cols":12,"rows_kept":39,"cut":false,"hidden":true,"merged":[]}
["Parametres de Projection"]
[]
[]
[]
[]
[]
[null,null,"Nom","Ro","Meridien Central","E/W","Lat. Origin","N/S","Applatissement","Easting d'origine","Northing d'origine"]
[null,1,"Lambert 1",5457616.6799999997,2.3372291666666669,"E",49.5,"N",0.99987734100000003,600000,1200000]
[null,2,"Lambert 2",5999695.7699999996,2.3372291666666669,"E",46.8,"N",0.99987742000000002,600000,2200000]
[null,3,"Lambert 3",6591905.0800000001,2.3372291666666669,"E",44.1,"N",0.999877499,600000,3200000]
{"$rows_left_out":30}
{"sheet":"Spheroides","index":4,"n_rows":56,"n_cols":8,"rows_kept":56,"cut":false,"hidden":false,"merged":[]}
["Liste des Ellipsoides Disponibles"]
[]
[]
[]
[]
[]
[null,null,"Nom","Demi Grand","Demi Petit","e2","n","1 / f"]
[null,1,"AIRY",6377563.3959999997,6356256.909,{"$f":"POWER(1/D8*(SQRT((D8*D8)-(E8*E8))),2)","v":6.6705400741490836E-3},1.6732202503250534E-3,{"$f":"1/((D8-E8)/D8)","v":299.32496126649505}]
[null,2,"AIRY MOD",6377340.1890000002,6356034.4479999999,6.6705399807736503E-3,1.6732203054869081E-3,299.32496546352854]
[null,3,"AUSTRALIAN NATIONAL 1967/84",6378160,6356774.7189999996,6.694541915624532E-3,null,{"$f":"1/((D10-E10)/D10)","v":298.24999727615801}]
{"$rows_left_out":47}
{"sheet":"Table Datum Shifts","index":5,"n_rows":203,"n_cols":186,"rows_kept":203,"cut":false,"hidden":false,"merged":[]}
["Datum System 1",null,"\"-0000,00;+0125,00;+0194,00;-0,000;-0,000;-0,000;-0,000\""]
["Datum System 2",null,"\"+0000,00;+0012,00;+0006,00;-0,000;-0,000;-0,000;+0,031\""]
[null,null,{"$f":"MID(C1,2,8)","v":"-0000,00"},{"$f":"MID(C1,11,8)","v":"+0125,00"},{"$f":"MID(C1,20,8)","v":"+0194,00"},{"$f":"MID(C1,29,6)","v":"-0,000"},{"$f":"MID(C1,36,6)","v":"-0,000"},{"$f":"MID(C1,43,6)","v":"-0,000"},{"$f":"MID(C1,50,6)","v":"-0,000"}]
[null,null,{"$f":"MID(C2,2,8)","v":"+0000,00"},{"$f":"MID(C2,11,8)","v":"+0012,00"},{"$f":"MID(C2,20,8)","v":"+0006,00"},{"$f":"MID(C2,29,6)","v":"-0,000"},{"$f":"MID(C2,36,6)","v":"-0,000"},{"$f":"MID(C2,43,6)","v":"-0,000"},{"$f":"MID(C2,50,6)","v":"+0,031"}]
[null,null,{"$f":"C3-C4","v":0},113,188,0,0,0,-3.1E-2]
[null,null,{"$f":"ABS(C5)","v":0},113,188,0,0,0,3.1E-2]
[null,null,{"$f":"TEXT(C6,\"0000,00\")","v":"0000,00"},{"$f":"TEXT(D6,\"0000,00\")","v":"0113,00"},{"$f":"TEXT(E6,\"0000,00\")","v":"0188,00"},{"$f":"TEXT(F6,\"0,000\")","v":"0,000"},{"$f":"TEXT(G6,\"0,000\")","v":"0,000"},{"$f":"TEXT(H6,\"0,000\")","v":"0,000"},{"$f":"TEXT(I6,\"0,000\")","v":"0,031"}]
[null,null,{"$f":"IF(C5>0,CONCATENATE(\"+\",C7),CONCATENATE(\"-\",C7))","v":"-0000,00"},"+0113,00","+0188,00","-0,000","-0,000","-0,000","-0,031"]
[null,null,{"$f":"CONCATENATE(\"\"\"\",C8,\";\")","v":"\"-0000,00;"},{"$f":"CONCATENATE(D8,\";\")","v":"+0113,00;"},{"$f":"CONCATENATE(E8,\";\")","v":"+0188,00;"},{"$f":"CONCATENATE(F8,\";\")","v":"-0,000;"},{"$f":"CONCATENATE(G8,\";\")","v":"-0,000;"},{"$f":"CONCATENATE(H8,\";\")","v":"-0,000;"},{"$f":"CONCATENATE(I8,\"\"\"\")","v":"-0,031\""}]
["Datum Calcule",null,{"$f":"CONCATENATE(C9,D9,E9,F9,G9,H9,I9)","v":"\"-0000,00;+0113,00;+0188,00;-0,000;-0,000;-0,000;-0,031\""}]
{"$rows_left_out":193}